RESCUE-MATE-Ontologie
type: Ontology
version IRI: http://rescue-mate.de/ontology/main/0.6.0
imports: bfo.owl
imports: iao.owl
imports: http://rescue-mate.de/ontology/wikidata-bridge/0.6.0
imports: prov-o-inverses-20130430
imports: https://w3id.org/function/ontology/1.0.0
license: https://creativecommons.org/licenses/by/4.0/
created: 2025-02-12
creator: Patrick Westphal
issued: 2025-11-07
modified: 2025-11-07
rights: CC BY 4.0 - RESCUE-MATE Project @en
title: RESCUE-MATE Ontology @en
comment: Haupt-Ontologie-Modul zur Unterstützung der Datenintegration im RESCUE-MATE-Projekt
comment: Main ontology module supporting the data integration part of the RESCUE-MATE project @en
prior version: http://rescue-mate.de/ontology/main/0.5.0
version info: 0.6

hat Kategorie
type: AnnotationProperty
label: has category @en

hat Client-Nachrichten-ID
type: AnnotationProperty
label: has client message ID @en
domain: Nachricht

hat erkannte Kategorie
type: AnnotationProperty
label: has detected category @en

hat externe ID
type: AnnotationProperty
comment: Assigns an ID that is external to the RESCUE-MATE data ecosystem @en
comment: Weist eine ID zu, die außerhalb des RESCUE-MATE-Datenökosystems verwendet wird
label: has external ID @en

hat FMS-Status-Wert
type: AnnotationProperty
comment: Annotates a FMS status message with its status code @en
comment: Annotiert eine FMS-Status-Nachricht mit dem entsprechenden FMS-Status-Wert
label: has FMS status code @en
range: int
domain: FMS-Nachricht

hat Vorfall-Nummer
type: AnnotationProperty
label: has incident number @en

hat Ressourcen-Typ
type: AnnotationProperty
comment: Informally annotates an operational resource with a resource type @en
comment: Informelle Annotation einer Einsatzressource mit einem Ressourcentyp
label: has resource type @en
range: string
domain: Einsatzmittel

hat Subkategorie
type: AnnotationProperty
label: has sub-category @en

hat Thread-ID
type: AnnotationProperty
label: has thread ID @en
sub property of: identifier

Autorenrolle der Nachricht
type: AnnotationProperty
label: message author role @en

gehört zu Deichverteidigungsgebiet
type: ObjectProperty
domain: Bauwerk
range: Deichverteidigungsgebiet
label: belongs to dike defense area @en

hat Bedarfsträger
type: ObjectProperty
range: BFO_0000002
label: has end user organization @en

hat Realisierungsträger
type: ObjectProperty
domain: Bauwerk
range: Juristische Person
label: has implementing agency @en

hat Benachrichtigung
type: ObjectProperty
domain: Benachrichtigungsereignis
range: IAO_0000030
comment: A relation between a notification event and an information content entity containing the actual notification. @en
comment: Eine Relation zwischen einem Benachrichtigungsereignis und einem Information Content Entity, das die eigentliche Benachrichtigung trägt.
label: has notification @en

hat Addressat für Benachrichtigung
type: ObjectProperty
domain: Benachrichtigungsereignis
range: BFO_0000023
comment: A relation between a notification event and a role (capturing, e.g., a group of individuals). The message, i.e., the actual notification of the notification event addresses the group of individuals having the target role. @en
comment: Eine Relation zwischen einem Benachrichtigungsereignis und einer Rolle (die z.B. eine Gruppe von Individuen zusammenfasst). Die Benachrichtigung des Benachrichtigungsereignisses ist an die Gruppe der Individuen addressiert, die die addressierte Rolle inne haben.
label: has notification target @en

hat Betreiber
type: ObjectProperty
domain: Anlage
range: Juristische Person
label: has operator @en

hat Position
type: ObjectProperty
domain: BFO_0000030
range: Position
comment: Beziehung zwischen einem Objekt und einer Position (d.h. einem Raum-Zeit-Punkt)
comment: Relation between an object and a position (being a point in space-time) @en
label: has position @en

Zuständigkeit Unterhaltung
type: ObjectProperty
domain: Bauwerk
range: Juristische Person
label: maintenance responsibility @en

zuständiger Deichwart
type: ObjectProperty
domain: Bauwerk
range: Deichwart
label: responsible dike warden @en

Zuständigkeit Aufsicht
type: ObjectProperty
domain: Bauwerk
range: Juristische Person
label: supervisory responsibility @en

Fahrzeug ist in Zustand
type: ObjectProperty
domain: Einsatzfahrzeug
range: Einsatzfahrzeugszustand
label: vehicle has state @en

Schartenbreite in Metern
type: DatatypeProperty
domain: Wasserbauwerk
range: float
label: clear width in meters @en

Schließwasserstand in Metern
type: DatatypeProperty
domain: Wasserbauwerk
range: float
label: closed water level in meters @en

Deichkilometer
type: DatatypeProperty
domain: Bauwerk
range: float
label: dike kilometer @en

Deichwart
type: DatatypeProperty
domain: Deichwart
label: dike warden @en

hat Priorität
type: DatatypeProperty
range: int
label: has priority @en

Drempelhöhe in Metern über Normalhöhennull
type: DatatypeProperty
domain: Wasserbauwerk
range: float
label: has sill height in meters above sea level @en

maximale Belegung
type: DatatypeProperty
range: int
label: maximum occupancy @en

Offenwasserstand in Metern
type: DatatypeProperty
domain: Wasserbauwerk
range: float
label: open water level in meters @en

schutzhoehe_m_ueber_nhn
type: DatatypeProperty
domain: Wasserbauwerk
range: float
label: protects up to height in meters above sea level @en

zweite Deichsicherheit
type: DatatypeProperty
domain: Wasserbauwerk
range: boolean
label: second dike safety @en

gesendet von Gerät mit Individual Short Subscriber Identity (ISSI)
type: DatatypeProperty
domain: FMS-Nachricht
range: string
label: sent from device with individual short subscriber identity (ISSI) @en

Baujahr
type: DatatypeProperty
domain: Bauwerk
range: gYear
label: year of construction @en

Abrollbehälter
type: Class
subclass of: Container
comment: Container designed as a closed box that can accommodate specific loads (materials and tools) and/or can be used for the accommodation of people (furnished and with doors and windows) @en
comment: Container, der als geschlossener Kasten ausgeführt ist und bestimmte Ladungen (Material und Werkzeug) aufnehmen oder/und für den Aufenthalt von Personen (möbliert und mit Türen und Fenstern) dienen kann
label: Abrollbehälter (Germany) @en

Anhängeleiter AL 16-4
type: Class
subclass of: Feuerwehrfahrzeug
subclass of: Anhänger
comment: Feuerwehranhänger mit Leiter mit einer Nennrettungshöhe von 16 Metern und Nennausladung von 4 Metern.
comment: Fire service trailer with a ladder with a nominal rescue height of 16 meters and a nominal outreach of 4 meters. @en
label: Anhängeleiter AL 16-4 (Germany) @en

Tätigkeit
type: Class
subclass of: BFO_0000015
comment: A process executed by an agent that has a certin outcome @en
comment: Ein Prozess, der von einem Agenten ausgeführt wird und ein bestimmtes Ergebnis hat
label: Activity @en

Hubrettungsfahrzeug
type: Class
subclass of: Feuerwehrfahrzeug
subclass of: Landfahrzeug
comment: Feuerwehrfahrzeug mit ausfahrbarer Leiter, Plattform oder ausfahrbarem Ausleger, das Feuerwehrleuten das Arbeiten in der Höhe zu Rettungs-, Lösch- und Zugangszwecken ermöglicht
comment: Fire-fighting vehicle equipped with an extendable ladder, platform, or boom that allows firefighters to work at height for rescue, firefighting, and access purposes @en
label: Aerial appliance @en

Hubarbeitsbühne
type: Class
subclass of: Hubrettungsfahrzeug
comment: Aerial appliance used to provide temporary access for people or equipment to inaccessible areas, usually at height. @en
comment: Hubrettungsfahrzeug mit einer begehbaren und beweglichen Plattform über die Personen und Ausrüstung in die Nähe unzugänglicher Bereiche, insb. in größerer Höhe bewegt werden können
label: Aerial work platform @en

Agent
type: Class
subclass of: BFO_0000002
comment: An independent continuant that bears some form of responsibility for an activity taking place @en
comment: Ein independent continuant der eine gewisse Verantwortlichkeit in Bezug auf eine Aktivität hat

Am Einsatzort eingetroffen
type: Class
subclass of: Einsatzfahrzeugszustand
IAO_0000116: status 4 (rd/fw/pol)
label: Arrived on scene @en

Am Zielort
type: Class
subclass of: Einsatzfahrzeugszustand
IAO_0000116: status 8 (fw)
label: At destination @en

Im Krankenhaus/am Transportziel angekommen
type: Class
subclass of: Am Zielort
IAO_0000116: status 8 (rd)
label: At hospital or other destination @en

An anderem Einsatz-/Sprechort
type: Class
subclass of: Am Zielort
IAO_0000116: status 8 (pol)
comment: Patrol is committed at some other defined location, e.g. courthouse, duty point, escort assignment @en
label: At other location @en

Einsatzbereit auf Wache
type: Class
subclass of: Einsatzfahrzeugszustand
IAO_0000116: status 2 (rd/fw/pol)
label: Available at station @en

Einsatzbereit über Funk
type: Class
subclass of: Einsatzfahrzeugszustand
IAO_0000116: status 1 (rd/fw/pol)
label: Available on radio @en

Betreuungslastkraftwagen
type: Class
equivalent class: Gerätewagen Betreuung
subclass of: Gerätewagen
label: Betreuungslastkraftwagen (Germany) @en

Gewerbebetrieb
type: Class
subclass of: Juristische Person
label: Business @en

CBRN-Erkundungswagen
type: Class
subclass of: Feuerwehrfahrzeug
subclass of: Landfahrzeug
comment: Feuerwehrfahrzeug zur Detektion von radiologischen und chemischen Kontaminationen
comment: Firefighting vehicle for the detection of radiological and chemical contamination @en
label: CBRN-Erkundungswagen (Germany) @en

Kampagne
type: Class
subclass of: Intensionale menschliche Aktivität
comment: Abfolge von über einen definierten Zeitraum geplanten oder tatsächlich ausgeführten Aktionen die einem gemeinsamen Zweck dienen.
comment: Series of actions planned for or executed during a defined time period that serve a common goal @en
label: Campaign @en

Veränderung
type: Class
subclass of: BFO_0000003
comment: Process, event or action that acts on the current state of something and generates a new state that deviates from the previous state @en
comment: Prozess, Ereignis oder Handlung, die auf den Zustand von etwas einwirkt und einen neuen Zustand schafft, der von dem vorherigen Zustand abweicht
label: Change @en

Chat
type: Class
subclass of: Activity
comment: An activity involving agents sending and receiving messages and/or media content @en
comment: Eine Aktivität, bei der sich Agenten gegenseitig Nachrichten und/oder Medien senden und diese empfangen

Chat-Bildnachricht
type: Class
subclass of: Chat-Nachricht
label: Chat image message @en

Chat-Nachricht
type: Class
subclass of: Nachricht
label: Chat message @en

Chat-Textnachricht
type: Class
subclass of: Chat-Nachricht
label: Chat text message @en

Chat-Videonachricht
type: Class
subclass of: Chat-Nachricht
label: Chat video message @en

Einsatzleitfahrzeug
type: Class
subclass of: Einsatzfahrzeug
comment: Einsatzfahrzeug zu Koordinierung des Einsatzes
comment: emergency vehicle to coordinate fire, ambulance, police, and technical operations @en
label: Command vehicle @en

Container
type: Class
subclass of: BFO_0000030
comment: Großraum-Behälter zur Lagerung und zum Transport von Gütern
comment: Large-capacity freight unit for the storage and transport of goods @en

Krisenereignis
type: Class
subclass of: BFO_0000003
comment: An occurrent descriping a crisis, i.e., an event potentially causing harm @en
comment: Ein Ereignis, das eine Krise beschreibt, d.h. ein Ereignis, das Schaden anrichten kann
label: Crisis event @en

Krisenereignis mit betroffenen Individuen
type: Class
subclass of: Krisenereignis
subclass of: Class
  intersection of: Krisenereignis
  intersection of: Restriction
    some values from: BFO_0000004
    on property: RO_0000057
comment: A crisis event which has individuals (i.e. independent continuants) as participants that are impacted by the crisis' outcome @en
comment: Ein Krisenereignis, an dem Individuen (d.h. bfo:IndipendentContinuants) beteiligt sind, die von den Auswirkungen des Krisenereignisses betroffen sind
label: Crisis event with affected individuals @en

Schadensminderung in einer Krise
type: Class
subclass of: Schadensminderung
comment: Process of reducting harm caused by a crisis @en
comment: Vorgang der Verringerung von Schäden, die duch eine Krise entstanden sind
label: Crisis mitigation @en

Drehleiter mit Handbetrieb
type: Class
subclass of: Feuerwehrfahrzeug
subclass of: Landfahrzeug
comment: Feuerwehrfahrzeug mit einer fest installierten Leiter, die sich um 360 Grad drehen lässt
comment: Fire-fighting vehicle with a ladder mounted on a pivot which resembles a turntable, able to rotate 360 degrees @en
label: Drehleiter mit Handbetrieb (Germany) @en

Vollautomatische Drehleiter
type: Class
subclass of: Drehleiter
comment: Drehleiter mit automatisiertem Aufricht- und Abstützvorgang
comment: Turntable ladder with automated erection and support process @en
label: Vollautomatische Drehleiter (Germany) @en

Drehleiter mit Korb
type: Class
subclass of: Drehleiter
comment: Drehleiter mit einem Korb
comment: Turntable ladder with basket @en
label: Drehleiter mit Korb (Germany) @en

Drehleiter mit Korb 12/9
type: Class
subclass of: Drehleiter mit Korb
comment: Drehleiter mit Korb und einer Nennrettungshöhe von 12 Metern bei 9 Metern Nennausladung
comment: Turntable ladder with a basket, a nominal rescue height of 12 meters, and a nominal outreach of 9 meters @en
label: Drehleiter mit Korb 12/9 (Germany) @en

Drehleiter mit Korb 18/12
type: Class
subclass of: Drehleiter mit Korb
comment: Drehleiter mit Korb und einer Nennrettungshöhe von 18 Metern bei 12 Metern Nennausladung
comment: Turntable ladder with a basket, a nominal rescue height of 18 meters, and a nominal outreach of 12 meters @en
label: Drehleiter mit Korb 18/12 (Germany) @en

Drehleiter mit Korb 23/12
type: Class
subclass of: Drehleiter mit Korb
comment: Drehleiter mit Korb und einer Nennrettungshöhe von 23 Metern bei 12 Metern Nennausladung
comment: Turntable ladder with a basket, a nominal rescue height of 23 meters, and a nominal outreach of 12 meters @en
label: Drehleiter mit Korb 23/12 (Germany) @en

Sequenzielle (halbautomatische) Drehleiter
type: Class
subclass of: Drehleiter
comment: Drehleiter, die nur eine Bewegung zur selben Zeit ausführen kann
comment: Turntable ladder that can only perform one movement at a time @en
label: Sequenzielle (halbautomatische) Drehleiter (Germany) @en

Beschädigung
type: Class
subclass of: Verringerung
comment: Changes to a system or object that adversely affect its current or future use or performance @en
comment: Änderungen an einem System oder Objekt, die seine Nützlichkeit oder Leistungsfähigkeit negativ beeinträchtigen
label: Damage @en

Tod
type: Class
subclass of: Beschädigung
comment: A damage inflicted on living organisms causing permanent cessation of vital functions @en
comment: Eine Beschädigung die einem Lebewesen zugeführt wird und zum endgültigen Verlust iherer Lebensfunktionen führt
label: Death @en

Wohnbereich Demenz
type: Class
subclass of: Anlage
comment: Anlage für das betreute Wohnen von Demenzpatienten
comment: Facility providing assisted living for dementia patients @en
label: Dementia care living area @en

Deichverteidigungsgebiet
type: Class
subclass of: BFO_0000006
label: Dike defense area @en

Deichwart
type: Class
subclass of: BFO_0000023
label: Dike warden @en

Deichsiel
type: Class
subclass of: Wasserbauwerk
label: Discharge sluice @en

Spendenaktion
type: Class
subclass of: Kampagne
comment: A campaign with the goal of collecting money or goods for a defined purpose @en
comment: Eine Kampagne mit dem Ziel Geld oder Güter für einen definierten Zweck zu sammeln
label: Donation campaign @en

Einsatzleitwagen
type: Class
subclass of: Einsatzleitfahrzeug
subclass of: Feuerwehrfahrzeug
subclass of: Landfahrzeug
comment: Command vehicle @en
label: Einsatzleitwagen (Germany) @en

Einsatzleitwagen ABC
type: Class
subclass of: Einsatzleitwagen
comment: Command vehicle within a CBRN unit for detecting and identifying hazardous substances @en
comment: Einsatzleitwagen im Rahmen des ABC-Zuges zum Aufspüren und Bestimmen von gefährlichen Stoffen
label: Einsatzleitwagen ABC (Germany) @en

Einsatzleitwagen 1
type: Class
subclass of: Einsatzleitwagen
comment: Command vehicle for small and medium sized operations; usually a van that provides space for the operational command @en
comment: Standard-Führungsfahrzeug bei Einsätzen bis zu mittlerem Umfang; normalerweise Kleintransporter zur Beherbergung der Einsatzleitung
label: Einsatzleitwagen 1 (Germany) @en

Einsatzleitwagen 2
type: Class
subclass of: Einsatzleitwagen
comment: Command vehicle for medium sized and larger operations; usually built on the chassis of a truck to provide space for a operational command meeting room and a radio room @en
comment: Einsatzleitwagen zur Koordination mittlerer und größerer Einsätze; Fahrzeug normalerweise basierend auf Fahrgestellen von Bussen oder Klein-Lkw; verfügt über einen Besprechungs- und einen Funkraum
label: Einsatzleitwagen 2 (Germany) @en

Elektronischer Antrieb
type: Class
subclass of: Antrieb
label: Electric propulsion @en

Elektrohydraulischer Antrieb
type: Class
subclass of: Antrieb
label: Electrohydraulic propulsion @en

Notruf
type: Class
subclass of: Priorisierter Sprechwunsch
IAO_0000116: status 0 (rd/fw)
label: Emergency call @en

Einsatzfahrzeug
type: Class
subclass of: Fahrzeug
comment: Speziell ausgerüstetes Fahrzeug einer Hilfsorganisation, einer Behörde oder Organisation mit Sicherheitsaufgaben
label: Emergency vehicle @en

Einsatzfahrzeugszustand
type: Class
subclass of: BFO_0000016
label: Emergency vehicle status @en

Auf dem Weg zum Einsatzort
type: Class
subclass of: Einsatzfahrzeugszustand
IAO_0000116: status 3 (rd/fw/pol)
label: En route @en

Auf dem Weg ins Krankenhaus mit Patient
type: Class
subclass of: Einsatzfahrzeugszustand
IAO_0000116: status 7 (san)
label: En route to hospital @en

Evakuierung
type: Class
subclass of: BFO_0000003
comment: Bewegung von Lebewesen aus einem möglichen oder tatsächlichen Gefahrenbereich
comment: Movement of living beings away from the threat of or the actual occurrence of a hazard @en
label: Evacuation @en

Feldkochherd
type: Class
subclass of: Anhänger
comment: Anhänger, in dem ein oder mehrere Kessel und eine oder mehrere Feuerstellen zur Essenszubereitung integriert sind
comment: Trailer with one or more boilers and one or more fireplaces for food preparation @en
label: Feldkochherd (Germany) @en

Feuerlöschboot
type: Class
subclass of: Feuerwehrfahrzeug
subclass of: Wasserfahrzeug
comment: Feuerwehrboot zur Brandbekämpfung von der Wasserseite
comment: Fireboat for firefighting from the waterside @en
label: Feuerlöschboot (Germany) @en

Flutlichtmastfahrzeug
type: Class
equivalent class: Gerätewagen Licht
subclass of: Gerätewagen
label: Flutlichtmastfahrzeug (Germany) @en

FMS-Nachricht
type: Class
subclass of: Nachricht
comment: Status message received or sent via the German Funkmeldesystem (FMS) @en
comment: Status-Nachricht, die über das Funkmeldesystem (FMS) gesendet oder empfangen wurde
label: FMS message @en

Anlage
type: Class
subclass of: Geographische Entität
comment: Geographic entity that was created to support a specific function @en
comment: Geographische Entität, die für einen bestimmten Zweck angelegt wurde
label: Facility @en

Finden
type: Class
subclass of: BFO_0000003
comment: Recovery of the spatial reference of someone or something @en
comment: Wiedererlangung des räumliche Bezugs zu jemanden oder etwas
label: Finding @en

Feuerlöschfahrzeug
type: Class
subclass of: Feuerwehrfahrzeug
subclass of: Landfahrzeug
comment: Feuerwehrfahrzeug mit einer fest eingebauten Feuerlöschpumpe oder einer Tragkraftspritze
comment: Fire-fighting vehicle with a permanently installed or portable fire pump @en
label: Fire engine @en

Feuerlöschfahrzeug mit fest eingebauter Feuerlöschpumpe
type: Class
subclass of: Löschfahrzeug
label: Fire engine with permanently installed fire pump @en

Feuerlöschfahrzeug mit mobiler Feuerlöschpumpe
type: Class
subclass of: Löschfahrzeug
label: Fire engine with portable fire pump @en

Feuerwehrfahrzeug
type: Class
subclass of: Einsatzfahrzeug
label: Fire-fighting vehicle @en

Bauwerk
type: Class
subclass of: Geographische Entität
label: Fixed construction @en

Flutschutztor
type: Class
subclass of: Wasserbauwerk
label: Flood gate @en

Feldkochherd
type: Class
subclass of: Feuerwehrfahrzeug
subclass of: Anhänger
comment: Feuerwehranhänger, in dem ein oder mehrere Kessel und eine oder mehrere Feuerstellen zur Essenszubereitung integriert sind
comment: Fire service trailer with one or more boilers and one or more fireplaces for food preparation @en
label: Feldkochherd (Germany) @en

Feuerwehranhänger Führung und Lage
type: Class
subclass of: Anhänger
comment: Feuerwehranhänger für die Bereitstellung eines mobilen Führungs- und Lageraum
comment: Fire service trailer for the provision of a mobile command and situation room @en
label: Feuerwehranhänger Führung und Lage (Germany) @en

Lichtmastanhänger
type: Class
subclass of: Anhänger
comment: A trailer providing a power generator and lighting components on one chassis @en
comment: Ein Anhänger zum Bereitstellen eines Stromerzeugungsaggregats und Beleuchtungskomponenten auf einem Fahrgestell
label: Lichtmastanhänger (Germany) @en

Anhänger mit Schaum-Wasserwerfer
type: Class
subclass of: Anhänger
comment: Feuerwehranhänger mit Schaum-Wasserwerfer
comment: Fire service trailer with foam water cannon @en
label: Anhänger mit Schaum-Wasserwerfer (Germany) @en

Feuerwehrkran
type: Class
subclass of: Feuerwehrfahrzeug
comment: Feuerwehrfahrzeug zur vertikalen und horizontalen Verladung oder Bewegung von Lasten; Einsatz zur technischen Hilfeleistung, Unterstützung bei der Menschenrettung und Unterstützung bei der Brandbekämpfung
comment: Firefighting vehicle for vertical and horizontal loading or movement of loads; use for technical assistance, assistance in rescue operations, and support in firefighting @en
label: Feuerwehrkran (Germany) @en

Großraumrettungswagen
type: Class
subclass of: Landfahrzeug
subclass of: Rettungsfahrzeug
comment: Rescue vehicle on a bus chassis @en
comment: Rettungsfahrzeug auf einem Omnibus-Fahrgestell
label: Großraumrettungswagen (Germany) @en

Gerätewagen
type: Class
subclass of: Einsatzfahrzeug
subclass of: Landfahrzeug
comment: Einsatzfahrzeug für den Transport von Gerät zur Einsatzstelle
comment: Emergency vehicle for transporting equipment to the incident scene @en
label: Gerätewagen (Germany) @en

Gerätewagen Atemschutz
type: Class
equivalent class: Gerätewagen Atemschutz
subclass of: Feuerwehrfahrzeug
subclass of: Gerätewagen
comment: Fire-fighting vehicle to transport equipment for the protection of the respiratory tract @en
comment: Gerätewagen für den Transport von Ausrüstung zum Schutz der Atemwege
label: Gerätewagen Atemschutz (Germany) @en

Gerätewagen Atemschutz Chemieschutz Strahlenschutz
type: Class
subclass of: Feuerwehrfahrzeug
subclass of: Gerätewagen
comment: Fire-fighting vehicle to transport equipment for the protection of the respiratory tract, harm caused by radiation or chemical hazards @en
comment: Gerätewagen für den Transport von Ausrüstung zum Schutz der Atemwege, Schutz gegen Beeinträchtigungen durch Strahlungen oder chemische Gefahren
label: Gerätewagen Atemschutz Chemieschutz Strahlenschutz (Germany) @en

Gerätewagen Atemschutz/Strahlenschutz
type: Class
equivalent class: Class
  intersection of: Gerätewagen Atemschutz
  intersection of: Gerätewagen Strahlenschutz
subclass of: Feuerwehrfahrzeug
subclass of: Gerätewagen
label: Gerätewagen Atemschutz/Strahlenschutz (Germany) @en

Gerätewagen Analytische Task Force
type: Class
subclass of: Feuerwehrfahrzeug
subclass of: Gerätewagen
comment: Fire-fighting vehicle to transport equiment for detecting and combating biological, chemical or radiological hazards @en
comment: Gerätewagen der Feuerwehr für den Transport von Ausrüstung zur Erkennung und Bekämpfung biologischer, chemischer oder radiologischer Gefahren
label: Gerätewagen Analytische Task Force (Germany) @en

Gerätewagen Atemschutz
type: Class
subclass of: Gerätewagen
label: Gerätewagen Atemschutz (Germany) @en

Gerätewagen Betreuung
type: Class
equivalent class: Gerätewagen Betreuung
subclass of: Gerätewagen
label: Gerätewagen Betreuung (Germany) @en

Gerätewagen Behandlung
type: Class
subclass of: Gerätewagen
comment: Emergency vehicle to transport equipment for the care of mass casualties and for the medical support of large events @en
comment: Gerätewagen zum Transport von Ausrüstung für die Versorgung bei einem Massenanfall von Verletzten sowie für die sanitätsdienstlichen Absicherung von Grossveranstaltungen
label: Gerätewagen Behandlung (Germany) @en

Gerätewagen Betreuung
type: Class
subclass of: Gerätewagen
comment: Geräewagen für den Transport von Ausrüstung zur Verpflegung von Einsatzkräften oder Hilfsbedürftigen
comment: Emergency vehicle to transport equipment and supplies for providing food to emergency personnel or those in need of assistance
label: Gerätewagen Betreuung (Germany) @en

Gerätewagen Dekontamination Personal
type: Class
subclass of: Gerätewagen
comment: Emergency vehicle to transport equipment for setting up a decontamination area to decontaminate emergency personell and affected persons that got in contact with hazardous substances in CBRN or hazardous substance accidents @en
comment: Gerätewagen für den Transport von Ausrüstung zur Einrichtung eines Dekontaminationsplatzes zur Dekontamination von Einsatzkräften und Betroffenen, die in ABC-Schadenslagen bzw. Gefahrstoffunfällen mit gefährlichen Substanzen in Berührung gekommen sind
label: Gerätewagen Dekontamination Personal (Germany) @en

Gerätewagen Gefahrtgut
type: Class
equivalent class: Gerätewagen Gefahrgut
subclass of: Feuerwehrfahrzeug
subclass of: Gerätewagen
comment: Fire-fighting vehicle for the transport of special equipment for biological, chemical, radiological hazards, and equipment for measuring/detecting, collecting, transferring and sealing hazardous goods or substances @en
comment: Gerätewagen der Feuerwehr für den Transport einer ABC-Sonderausrüstung und von Geräten zum Messen/Nachweisen, Auffangen, Umfüllen und Abdichten von Gefahrgütern bzw. -stoffen
label: Gerätewagen Gefahrtgut (Germany) @en

Gerätewagen Gefahrgut 1
type: Class
subclass of: Gerätewagen Gefahrtgut
comment: Fire-fighting vehicle for the transport of a smaller amount of special equipment for biological, chemical, radiological hazards, and equipment for measuring/detecting, collecting, transferring and sealing hazardous goods or substances @en
comment: Gerätewagen der Feuerwehr für den Transport einer ABC-Sonderausrüstung und von Geräten kleineren Umfangs zum Messen/Nachweisen, Auffangen, Umfüllen und Abdichten von Gefahrgütern bzw. -stoffen
label: Gerätewagen Gefahrgut 1 (Germany) @en

Gerätewagen Gefahrgut 2
type: Class
subclass of: Gerätewagen Gefahrtgut
comment: Fire-fighting vehicle for the transport of a medium amount of special equipment for biological, chemical, radiological hazards, and equipment for measuring/detecting, collecting, transferring and sealing hazardous goods or substances @en
comment: Gerätewagen der Feuerwehr für den Transport einer ABC-Sonderausrüstung und von Geräten mittleren Umfangs zum Messen/Nachweisen, Auffangen, Umfüllen und Abdichten von Gefahrgütern bzw. -stoffen
label: Gerätewagen Gefahrgut 2 (Germany) @en

Gerätewagen Gefahrgut 3
type: Class
subclass of: Gerätewagen Gefahrtgut
comment: Fire-fighting vehicle for the transport of a greater amount of special equipment for biological, chemical, radiological hazards, and equipment for measuring/detecting, collecting, transferring and sealing hazardous goods or substances @en
comment: Gerätewagen der Feuerwehr für den Transport einer ABC-Sonderausrüstung und von Geräten größeren Umfangs zum Messen/Nachweisen, Auffangen, Umfüllen und Abdichten von Gefahrgütern bzw. -stoffen
label: Gerätewagen Gefahrgut 3 (Germany) @en

Gerätewagen Gefahrgut
type: Class
subclass of: Gerätewagen
label: Gerätewagen Gefahrgut (Germany) @en

Gerätewagen Höhenrettung
type: Class
equivalent class: Gerätewagen Spezielle Rettung aus Höhen und Tiefen
subclass of: Gerätewagen
comment: Emergency vehicle to transport equipment for rescue from heights and depths @en
comment: Gerätewagen für den Transport von Ausrüstung zur Rettung aus Höhen und Tiefen
label: Gerätewagen Höhenrettung (Germany) @en

Gerätewagen Logistik
type: Class
equivalent class: Gerätewagen Logistik
subclass of: Gerätewagen
comment: Emergency vehicle to transport material and equipment to provide support in various operational situations @en
comment: Gerätewagen für den Transport von Material und Ausrüstung zur Bewältigung verschiedener Einsatzlagen
label: Gerätewagen Logistik (Germany) @en

Gerätewagen Logistik 1
type: Class
subclass of: Gerätewagen Logistik
comment: Emergency vehicle in the German weight category L (Leicht - 2.0 - 7.5 tons) to transport material and equipment to provide support in various operational situations @en
comment: Gerätewagen der Kraftfahrzeug-Gewichtsklasse L (Leicht - 2,0 - 7,5 Tonnen) für den Transport von Material und Ausrüstung für die Bewältigung verschiedener Einsatzlagen
label: Gerätewagen Logistik 1 (Germany) @en

Gerätewagen Logistik 2
type: Class
subclass of: Gerätewagen Logistik
comment: Emergency vehicle in the German weight category M (Mittel - 7.5 - 14.0 tons) to transport material and equipment to provide support in various operational situations @en
comment: Gerätewagen der Kraftfahrzeug-Gewichtsklasse M (Mittel - 7,5 - 14,0 Tonnen) für den Transport von Material und Ausrüstung für die Bewältigung verschiedener Einsatzlagen
label: Gerätewagen Logistik 2 (Germany) @en

Gerätewagen Licht
type: Class
subclass of: Gerätewagen
comment: Emergency vehicle to transport a mobile or stationary light mast for operations at night @en
comment: Gerätewagen zum Transport eines mobilen oder stationären Lichtmastes für nächtliche Einsätze
label: Gerätewagen Licht (Germany) @en

Gerätewagen Logistik
type: Class
subclass of: Gerätewagen
label: Gerätewagen Logistik (Germany) @en

Gerätewagen Massenanfall von Verletzten
type: Class
subclass of: Gerätewagen
comment: Emergency vehicle to transport equipment for supoprt in cases of a mass casualty incident @en
comment: Gerätewagen für den Transport von Ausrüstung zur Unterstützung bei MANV (Manssenanfall von Verletzten)-Lagen
label: Gerätewagen Massenanfall von Verletzten (Germany) @en

Gerätewagen Messtechnik
type: Class
subclass of: Gerätewagen
comment: Gerätewagen (Germany) for transporting extensive equipment for measuring and detecting @en
comment: Gerätewagen zum Transport einer umfangreichen Ausrüstung zum Messen und Spüren
label: Gerätewagen Messtechnik (Germany) @en

Gerätewagen Nachschub (Germany)
type: Class
subclass of: Gerätewagen
comment: Emergency vehicle to transport material and equipment to provide support in various operational situations @en
comment: Gerätewagen für den Transport von Material und Ausrüstung zur Bewältigung verschiedener Einsatzlagen

Gerätewagen Öl
type: Class
subclass of: Gerätewagen
comment: Fire-fighting vehicle to transport equipment for countering mineral oil spills @en
comment: Gerätewagen der Feuerwehr für den Transport von Ausrüstung zur Bekämpfung von Mineralölunfällen
label: Gerätewagen Öl (Germany) @en

Gerätewagen Rettungsdienst
type: Class
subclass of: Gerätewagen
comment: Emergency vehicle to transport material for setting up and running a medical treatment facility @en
comment: Gerätewagen für den Transport von Material zum Errichten und Betreiben eines Behandlungsplatzes
label: Gerätewagen Rettungsdienst (Germany) @en

Gerätewagen Rettung
type: Class
subclass of: Gerätewagen
comment: Emergency vehicle to transport material for setting up and running a medical treatment facility @en
comment: Gerätewagen für den Transport von Material zum Errichten und Betreiben eines Behandlungsplatzes
label: Gerätewagen Rettung (Germany) @en

Gerätewagen Rettungshundestaffel
type: Class
subclass of: Gerätewagen
comment: Emergency vehicle to transport rescue dogs, and rescue and first aid equipment @en
comment: Gerätewagen zum Transport von Rettungshunden, und Rettungs- und Erste-Hilfe-Ausrüstung
label: Gerätewagen Rettungshundestaffel (Germany) @en

Gerätewagen Strahlenschutz
type: Class
equivalent class: Gerätewagen Strahlenschutz
subclass of: Feuerwehrfahrzeug
subclass of: Gerätewagen
comment: Fire-figting vehicle to transport equipment for protection against harm caused by radiation @en
comment: Gerätewagen der Feuerwehr für den Transport von Ausrüstung für den Schutz gegen Beeinträchtigungen durch Strahlungen
label: Gerätewagen Strahlenschutz (Germany) @en

Gerätewagen Spezielle Rettung aus Höhen und Tiefen
type: Class
subclass of: Gerätewagen
comment: Emergency vehicle to transport equipment for rescue from heights and depths @en
comment: Gerätewagen für den Transport von Ausrüstung zur Rettung aus Höhen und Tiefen
label: Gerätewagen Spezielle Rettung aus Höhen und Tiefen (Germany) @en

Gerätewagen Sanität
type: Class
subclass of: Gerätewagen
comment: Emergency vehicle to transport material for setting up and running a medical treatment facility @en
comment: Gerätewagen für den Transport von Material zum Errichten und Betreiben eines Behandlungsplatzes
label: Gerätewagen Sanität (Germany) @en

Gerätewagen Strahlenspürtrupp
type: Class
subclass of: Feuerwehrfahrzeug
subclass of: Gerätewagen
comment: Fire-fighting vehicle to transport equipment for hazardous materials handling and monitoring the environment after an incident for radioactive contamination as well as radiation protection @en
comment: Gerätewagen der Feuerwehr zum Transport von Messgeräten und Ausrüstung für den Gefahrguteinsatz und die Überwachung der Umgebung nach einem Störfall auf radioaktive Kontamination sowie der Strahlenschutz
label: Gerätewagen Strahlenspürtrupp (Germany) @en

Gerätewagen Strahlenschutz
type: Class
subclass of: Gerätewagen
label: Gerätewagen Strahlenschutz (Germany) @en

Gerätewagen Tauchen
type: Class
equivalent class: Gerätewagen Tauchen
equivalent class: Taucheinsatzfahrzeug
subclass of: Gerätewagen
subclass of: Class
  union of: Feuerwehrfahrzeug
  union of: Rettungsfahrzeug
comment: Emergency vehicle to transport rescue divers and their equipment to the incident scene @en
comment: Gerätewagen für den Transport von Rettungstauchern und ihrer Ausrüstung zum Einsatzort
label: Gerätewagen Tauchen (Germany) @en

Gerätewagen Tragkraftspritze
type: Class
subclass of: Feuerwehrfahrzeug
subclass of: Gerätewagen
comment: Fire-fighting vehicle for transporting equipment similar to the gear of a Tragkraftspritzenanhänger (TSA) @en
comment: Gerätewagen, der in Bezug auf seine Ausrüstung wie ein Tragkraftspritzenanhänger (TSA) ausgelegt ist
label: Gerätewagen Tragkraftspritze (Germany) @en

Gerätewagen Tauchen
type: Class
subclass of: Gerätewagen
label: Geräteagen Tauchen (Germany) @en

Gerätewagen Technik und Sicherheit
type: Class
equivalent class: Gerätewagen Technik
subclass of: Gerätewagen
label: Gerätewagen Technik und Sicherheit (Germany) @en

Gerätewagen Technik
type: Class
equivalent class: Gerätewagen Technik und Sicherheit
subclass of: Gerätewagen
comment: Emergency vehicle to transport an extensive amount of materials and tools for an effective support at the incident scene @en
comment: Gerätewagen für den Transport von umfangreichem Material und Werkzeug zur effektiven Hilfeleistung am Einsatzort
label: Gerätewagen Technik (Germany) @en

Gerätewagen Tierrettung
type: Class
equivalent class: Gerätewagen Tierrettung
subclass of: Feuerwehrfahrzeug
label: Gerätewagen Tierrettung (Germany) @en

Gerätewagen Tierrettung
type: Class
subclass of: Feuerwehrfahrzeug
subclass of: Gerätewagen
comment: Fire-fighting vehicle to transport equipment for saving animals @en
comment: Gerätewagen für den Transport von Ausrüstung zur Rettung von Tieren
label: Gerätewagen Tierrettung (Germany) @en

Gerätewagen Transport
type: Class
subclass of: Gerätewagen
comment: Emergency vehicle to transport material and equipment to provide support in various operational situations @en
comment: Gerätewagen für den Transport von Material und Ausrüstung zur Bewältigung verschiedener Einsatzlagen
label: Gerätewagen Transport (Germany) @en

Gerätewagen Technik und Sicherheit
type: Class
subclass of: Gerätewagen
label: Gerätewagen Technik und Sicherheit (Germany) @en

Gerätewagen Verpflegung
type: Class
equivalent class: Gerätewagen Verpflegung
subclass of: Gerätewagen
comment: Emergency vehicle to transport equipment and supplies for setting up and running a catering point @en
comment: Gerätewagen zum Transport von Ausrüstung und Ausstattung für den Aufbau und Betrieb einer Verpflegungsstelle
label: Gerätewagen Verpflegung (Germany) @en

Gerätewagen Verpflegung
type: Class
subclass of: Gerätewagen
label: Gerätewagen Verpflegung (Germany) @en

Gerätewagen Wasserrettung
type: Class
equivalent class: Gerätewagen Wasserrettung
equivalent class: Wasserrettungswagen
subclass of: Gerätewagen
comment: An emergency vehicle for transporting equipment for water rescue operations @en
comment: Ein Gerätewagen für den Transport von Wasserrettungsausrüstung
label: Gerätewagen Wasserrettung (Germany) @en

Gerätewagen Wasserrettung
type: Class
subclass of: Gerätewagen
label: Gerätewagen Wasserrettung (Germany) @en

Geographische Entität
type: Class
subclass of: BFO_0000030
comment: An object that is stationary, can be described and located at a geographical position @en
comment: Ein Objekt, das sich stationär an einer geographischen Position befindet, lokalisiert und beschrieben werden kann
label: Geographic entity @en

Bezirksamt
type: Class
subclass of: Juristische Person
label: German borough office @en

Anstalt des öffentlichen Rechts
type: Class
subclass of: Juristische Person
label: German public law institution @en

Landesbehörde (Deutschland)
type: Class
subclass of: Juristische Person
label: German state agency @en

Landesbetrieb
type: Class
subclass of: Juristische Person
label: German state enterprise @en

Verschwinden
type: Class
subclass of: BFO_0000003
comment: Losing the spatial reference of someone or something @en
comment: Verlust des räumlichen Bezugs zu jemanden oder etwas
label: Getting lost @en

Gruppenkraftwagen
type: Class
subclass of: Polizeifahrzeug
comment: Police vehicle to transport groups of people @en
comment: Polizeifahrzeug zum Transport von Personengruppen
label: Gruppenkraftwagen (Germany) @en

Hubarbeitsbühne
type: Class
subclass of: Hubarbeitsbühne
label: Hubarbeitsbühne (Germany) @en

Hubarbeitsbühne 18/12
type: Class
subclass of: Hubarbeitsbühne
comment: Aerial work platform with a nominal height of 18 meters and a nominal outreach of 12 meters @en
comment: Hubarbeitsbühne mit einer Nennhöhe von 18 Metern bei 12 Metern Nennausladung
label: Hubarbeitsbühne 18/12 (Germany) @en

Hubarbeitsbühne 18/12
type: Class
subclass of: Hubarbeitsbühne
comment: Aerial work platform with a nominal height of 23 meters and a nominal outreach of 12 meters @en
comment: Hubarbeitsbühne mit einer Nennhöhe von 23 Metern bei 12 Metern Nennausladung
label: Hubarbeitsbühne 23/12 (Germany) @en

Hilfeleistungslöschgruppenfahrzeug (Germany)
type: Class
subclass of: Feuerlöschfahrzeug mit fest eingebauter Feuerlöschpumpe
subclass of: Landfahrzeug
comment: Feuerwehr-Fahrzeug für den Transport von Besatzung und Ausrüstung zur Brandbekämpfung sowie umfangreicher Ausrüstung für die technische Hilfeleistung
comment: Fire-fighting vehicle for the transport of crew and equipment for fire-fighting as well as extensive equipment for technical assistance @en
label: Hilfeleistungslöschgruppenfahrzeug

Hilfeleistungslöschgruppenfahrzeug 10
type: Class
subclass of: Hilfeleistungslöschgruppenfahrzeug (Germany)
comment: Hilfeleistungslöschgruppenfahrzeug (Germany) with a water tank of 1000 liters capacity and a supply of 120 liters of foam agent, and a fire extinguishing centrifugal pump with a flow rate of 1,000 liters of water per minute at an output pressure of 10 bar @en
comment: Hilfeleistungslöschgruppenfahrzeug mit einen Wassertank von 1000 Litern Inhalt sowie einem Vorrat von 120 Liter Schaummittel, und einer Feuerlöschkreiselpumpe mit einer Förderleistung von 1.000 Liter Wasser in der Minute bei einem Ausgangsdruck von 10 bar
label: Hilfeleistungslöschgruppenfahrzeug 10 (Germany) @en

Hilfeleistungslöschgruppenfahrzeug 10/6
type: Class
subclass of: Hilfeleistungslöschgruppenfahrzeug (Germany)
comment: Hilfeleistungslöschgruppenfahrzeug (Germany) with a water tank of 600 liters capacity and a fire extinguishing centrifugal pump with a flow rate of 1,000 liters of water per minute at an output pressure of 10 bar @en
comment: Hilfeleistungslöschgruppenfahrzeug mit einen Wassertank von 600 Litern Inhalt und einer Feuerlöschkreiselpumpe mit einer Förderleistung von 1.000 Liter Wasser in der Minute bei einem Ausgangsdruck von 10 bar
label: Hilfeleistungslöschgruppenfahrzeug 10/6 (Germany) @en

Hilfeleistungslöschgruppenfahrzeug 20
type: Class
subclass of: Hilfeleistungslöschgruppenfahrzeug (Germany)
comment: Hilfeleistungslöschgruppenfahrzeug (Germany) with a water tank of 1,600 liters capacity, a supply of 120 liters of foam agent as well as 12 kg of extinguishing powder, and a fire extinguishing centrifugal pump with a flow rate of 2,000 liters of water per minute at an output pressure of 10 bar @en
comment: Hilfeleistungslöschgruppenfahrzeug mit einen Wassertank von mindestens 1.600 Litern Inhalt, einem Vorrat von 120 Liter Schaummittel sowie 12 kg Löschpulver, und einer Feuerlöschkreiselpumpe mit einer Förderleistung von 2.000 Liter Wasser in der Minute bei einem Ausgangsdruck von 10 bar
label: Hilfeleistungslöschgruppenfahrzeug 20 (Germany) @en

Hilfeleistungslöschgruppenfahrzeug 20/16
type: Class
subclass of: Hilfeleistungslöschgruppenfahrzeug (Germany)
comment: Hilfeleistungslöschgruppenfahrzeug (Germany) with a water tank of 1,600 liters capacity, a supply of 120 liters of foam agent as well as 12 kg of extinguishing powder, and a fire extinguishing centrifugal pump with a flow rate of 2,000 liters of water per minute at an output pressure of 10 bar @en
comment: Hilfeleistungslöschgruppenfahrzeug mit einen Wassertank von mindestens 1.600 Litern Inhalt, einem Vorrat von 120 Liter Schaummittel sowie 12 kg Löschpulver, und einer Feuerlöschkreiselpumpe mit einer Förderleistung von 2.000 Liter Wasser in der Minute bei einem Ausgangsdruck von 10 bar
label: Hilfeleistungslöschgruppenfahrzeug 20/16 (Germany) @en

Hilfeleistungslöschgruppenfahrzeug 24/14-Schiene
type: Class
subclass of: Hilfeleistungslöschgruppenfahrzeug (Germany)
comment: Hilfeleistungslöschgruppenfahrzeug (Germany) that can also drive on rails and is therefore particularly suitable for fire-fighting in tunnels and technical accident assistance on the rails @en
comment: Hilfeleistungslöschgruppenfahrzeug das zusätzlich auch auf Schienen fahren kann und sich daher besonders für die Brandbekämpfung in Tunneln und die technische Unfallhilfe auf der Schiene eignet
label: Hilfeleistungslöschgruppenfahrzeug 24/14-Schiene (Germany) @en

Klapptor
type: Class
subclass of: Flutschutztor
label: Hinged crest gate @en

Menschliche Tätigkeit
type: Class
subclass of: Tätigkeit
comment: An activity that is performed by a human being @en
comment: Eine Tätigkeit, die von einem Menschen ausgeführt wird
label: Human activity @en

Humanitäre Tätigkeit
type: Class
subclass of: Intensionale menschliche Aktivität
comment: An activity that is performed by a human being, driven by humanitarian motives, involving assistance to others and improvement of conditions for humanity @en
comment: Eine Tätigkeit, die von einem Menschen ausgeführt wird und von einem bewussten humanitären Ziel getrieben wird, insb. der Hilfe anderer und der Verbesserung von Lebensbedingungen von Menschen
label: Humanitarian activity @en

Kreuzungsbauwerk
type: Class
subclass of: Wasserbauwerk
label: Hydraulic crossing structure @en

Wasserbauwerk
type: Class
subclass of: Bauwerk
label: Hydraulic structure @en

Infektionsrettungswagen
type: Class
subclass of: Landfahrzeug
subclass of: Rettungsfahrzeug
comment: Rescue vehicle for the transport of highly infectious or highly contagious persons, in which the patient compartment is completely sealed off from the outside world and the driver's cab @en
comment: Rettungsfahrzeug für die Beförderung hochinfektiöser bzw. hochkontagiöser Personen, bei dem der Patientenraum im Aufbau komplett zur Außenwelt sowie zum Führerhaus hin abgedichtet ist
label: Infektionsrettungswagen (Germany) @en

Intensivtransportwagen
type: Class
equivalent class: Mobile Intensive Care Unit
subclass of: Landfahrzeug
subclass of: Rettungsfahrzeug
comment: Rescue vehicle specially equipped to transport patients requiring intensive care between intensive care units from hospital to hospital @en
comment: Rettungsfahrzeug, das speziell ausgestattet ist, um intensivpflichtige Patienten zwischen Intensivstationen von Krankenhaus zu Krankenhaus zu transportieren
label: Intensivtransportwagen (Germany) @en

Beschädigung von Infrastruktur
type: Class
subclass of: Beschädigung
comment: Beschädigung von Infrastruktur wie Straßen, Brücken, Gebäuden, Netzen für die Wasser- und Stromversorgung, oder Kommunikationsnetze
comment: Damage of infrastructure elements like roads, bridges, buildings or utilities like water, electricity, and communication networks @en
label: Infrastructure damage @en

Verletzung
type: Class
subclass of: Beschädigung
comment: A damage inflicted on living organisms impairing their physiological conditions @en
comment: Eine Beschädigung die einem Lebewesen zugeführt wird und deren körperliche Verfasssung negativ beeinträchtigt
label: Injury @en

Verletzung beim Menschen
type: Class
subclass of: Verletzung
comment: A damage inflicted on living a human being impairing their physiological conditions @en
comment: Eine Beschädigung die einem Menschen zugeführt wird und dessen körperliche Verfasssung negativ beeinträchtigt
label: Injury in humans @en

Intensionale menschliche Aktivität
type: Class
subclass of: Menschliche Tätigkeit
comment: An activity that is performed by a human being, driven by purposeful motives @en
comment: Eine Tätigkeit, die von einem Menschen ausgeführt wird und von einer bewussten Motivation getrieben wird
label: Intentional human activity @en

Juristische Person
type: Class
subclass of: BFO_0000031
label: Juridical person @en

Kleineinsatzfahrzeug
type: Class
equivalent class: KLAF
equivalent class: KLEF
subclass of: Feuerwehrfahrzeug
comment: Feuerwehrfahrzeug, das für kleineren technische Hilfeleistungen eingesetzt wird, die nur wenig Personal und Material benötigen
comment: Fire-fighting vehicle that is used for less extensicve technical support, which requires only a smaller amount of people and material @en
label: Kleineinsatzfahrzeug (Germany) @en

Klein(lösch)boot
type: Class
subclass of: Feuerwehrfahrzeug
subclass of: Wasserfahrzeug
comment: Feuerwehrboot für den Transport von Ausrüstung für die Wasserrettung, und optional Löschgeräten
comment: Fireboat for the transport of equipment for water rescue, and optional firefighting equipment @en
label: Klein(lösch)boot (Germany) @en

Kleinlöschfahrzeug
type: Class
subclass of: Feuerlöschfahrzeug mit mobiler Feuerlöschpumpe
comment: Kleines Feuerlöschfahrzeug mit Tragkraftspritze und einem Löschwassertank mit 500 Litern Fassungsvermögen sowie 6 kg Löschpulver
comment: Small fire engine with a portable fire pump and a water tank of 500 liters capacity and 6 kg of extinguishing powder @en
label: Kleinlöschfahrzeug (Germany) @en

Krankentransportwagen
type: Class
subclass of: Landfahrzeug
subclass of: Rettungsfahrzeug
comment: Rescue vehicle for the transport and care of non-acutely injured or ill persons @en
comment: Rettungsfahrzeug für den Transport und die Betreuung von nicht-akut verletzten oder erkrankten Personen
label: Krankentransportwagen (Germany) @en

Kommandowagen
type: Class
subclass of: Einsatzleitfahrzeug
subclass of: Landfahrzeug
comment: Command vehicle for small operations; usually a passenger car for transporting the operational command @en
comment: Einsatzleitfahrzeug für kleinere Einsätze; in der Regel ein Pkw oder Kombi für den Transport der Führungskräfte
label: Kommandowagen (Germany) @en

Löschgruppenfahrzeug
type: Class
subclass of: Feuerlöschfahrzeug mit fest eingebauter Feuerlöschpumpe
comment: Feuerwehrfahrzeug für den Transport von Besatzung und Ausrüstung zur Brandbekämpfung und für technische Hilfeleistung einfachen Umfangs
comment: Fire-fighting vehicle for the transport of crew and equipment for fire-fighting and for simple technical assistance @en
label: Löschgruppenfahrzeug (Germany) @en

Löschgruppenfahrzeug für den Katastrophenschutz
type: Class
equivalent class: Löschgruppenfahrzeug 16 TS
subclass of: Löschgruppenfahrzeug
comment: Löschgruppenfahrzeug (Germany) primarily used for disaster protection @en
comment: Löschgruppenfahrzeug das vorrangig für den Katstrophenschutz eingesetzt wird
label: Löschgruppenfahrzeug für den Katastrophenschutz (Germany) @en

Löschgruppenfahrzeug 10
type: Class
subclass of: Löschgruppenfahrzeug
comment: Löschgruppenfahrzeug (Germany) with a fire-fighting centrifugal pump with a capacity of 1,000 liters of water per minute @en
comment: Löschgruppenfahrzeug mit einer Feuerlöschkreiselpumpe mit einer Förderleistung von 1.000 Liter Wasser in der Minute
label: Löschgruppenfahrzeug 10 (Germany) @en

Löschgruppenfahrzeug 10/6
type: Class
subclass of: Löschgruppenfahrzeug
comment: Löschgruppenfahrzeug (Germany) with a water tank capacity of at least 600 liters and a fire-fighting centrifugal pump with a capacity of 1000 liters of water per minute @en
comment: Löschgruppenfahrzeug mit einer Feuerlöschkreiselpumpe mit einer Förderleistung von 1000 Liter Wasser in der Minute und einem Löschwasservorrat von mindestens 600 Litern
label: Löschgruppenfahrzeug 10/6 (Germany) @en

Löschgruppenfahrzeug 16
type: Class
subclass of: Löschgruppenfahrzeug
comment: Löschgruppenfahrzeug (Germany) with a fire-fighting centrifugal pump with a capacity of 1,600 liters of water per minute @en
comment: Löschgruppenfahrzeug mit einer Feuerlöschkreiselpumpe mit einer Förderleistung von 1.600 Liter Wasser in der Minute
label: Löschgruppenfahrzeug 16 (Germany) @en

Löschgruppenfahrzeug 16/12
type: Class
subclass of: Löschgruppenfahrzeug
comment: Löschgruppenfahrzeug (Germany) with a water tank capacity of 1,200 liters and a fire-fighting centrifugal pump with a capacity of 1,600 liters of water per minute @en
comment: Löschgruppenfahrzeug mit einer Feuerlöschkreiselpumpe mit einer Förderleistung von 1.600 Liter Wasser in der Minute und einem Löschwasservorrat von 1.200 Litern
label: Löschgruppenfahrzeug 16/12 (Germany) @en

Löschgruppenfahrzeug 16 TS
type: Class
subclass of: Löschgruppenfahrzeug
label: Löschgruppenfahrzeug 16 TS (Germany) @en

Löschgruppenfahrzeug 20
type: Class
subclass of: Löschgruppenfahrzeug
comment: Löschgruppenfahrzeug (Germany) with a fire-fighting centrifugal pump with a capacity of 2,000 liters of water per minute @en
comment: Löschgruppenfahrzeug mit einer Feuerlöschkreiselpumpe mit einer Förderleistung von 2.000 Liter Wasser in der Minute
label: Löschgruppenfahrzeug 20 (Germany) @en

Löschgruppenfahrzeug 20/16
type: Class
subclass of: Löschgruppenfahrzeug
comment: Löschgruppenfahrzeug (Germany) with a water tank capacity of 1,600 liters and a fire-fighting centrifugal pump with a capacity of 2,000 liters of water per minute @en
comment: Löschgruppenfahrzeug mit einer Feuerlöschkreiselpumpe mit einer Förderleistung von 2.000 Liter Wasser in der Minute und einem Löschwasservorrat von 1.600 Litern
label: Löschgruppenfahrzeug 20/16 (Germany) @en

Löschgruppenfahrzeug 20 für den Katastrophenschutz
type: Class
subclass of: Löschgruppenfahrzeug für den Katastrophenschutz
comment: Löschgruppenfahrzeug für den Katastrophenschutz (Germany) with a fire-fighting centrifugal pump with a capacity of 2,000 liters of water per minute @en
comment: Löschgruppenfahrzeug für den Katastrophenschutz mit einer Feuerlöschkreiselpumpe mit einer Förderleistung von 2.000 Liter Wasser in der Minute
label: Löschgruppenfahrzeug 20 für den Katastrophenschutz (Germany) @en

Löschgruppenfahrzeug 24
type: Class
subclass of: Löschgruppenfahrzeug
comment: Löschgruppenfahrzeug (Germany) with a fire-fighting centrifugal pump with a capacity of 2,400 liters of water per minute @en
comment: Löschgruppenfahrzeug mit einer Feuerlöschkreiselpumpe mit einer Förderleistung von 2.400 Liter Wasser in der Minute
label: Löschgruppenfahrzeug 24 (Germany) @en

Löschgruppenfahrzeug 8
type: Class
subclass of: Löschgruppenfahrzeug
comment: Löschgruppenfahrzeug (Germany) with a fire-fighting centrifugal pump with a capacity of 800 liters of water per minute @en
comment: Löschgruppenfahrzeug mit einer Feuerlöschkreiselpumpe mit einer Förderleistung von 800 Liter Wasser in der Minute
label: Löschgruppenfahrzeug 8 (Germany) @en

Löschgruppenfahrzeug 8/6
type: Class
subclass of: Löschgruppenfahrzeug
comment: Löschgruppenfahrzeug (Germany) with a water tank capacity of at least 600 liters and a fire-fighting centrifugal pump with a capacity of 800 liters of water per minute @en
comment: Löschgruppenfahrzeug mit einer Feuerlöschkreiselpumpe mit einer Förderleistung von 800 Liter Wasser in der Minute und einem Löschwasservorrat von 600 Litern
label: Löschgruppenfahrzeug 8/6 (Germany) @en

Lastkraftwagen
type: Class
subclass of: Landfahrzeug
subclass of: Fahrzeug
label: Lorry @en

Landfahrzeug
type: Class
subclass of: Fahrzeug
label: Land vehicle @en

Lichtmastkraftwagen
type: Class
subclass of: Polizeifahrzeug
comment: Police vehicle to transport a mobile or stationary light mast for operations at night @en
comment: Polizeifahrzeug zum Transport eines mobilen oder stationären Lichtmastes für nächtliche Einsätze
label: Lichtmastkraftwagen (Germany) @en

Erwähnung eines Ortes
type: Class
subclass of: IAO_0000300
subclass of: Restriction
  some values from: BFO_0000006
  on property: IAO_0000136
comment: Eine textuelle Entität, die auf einen Ort verweist
comment: Textual entity that refers to a location @en
label: Location mention @en

Schleuse
type: Class
subclass of: Wasserbauwerk
label: Lock @en

Mobile Intensive Care Unit
type: Class
subclass of: Landfahrzeug
subclass of: Rettungsfahrzeug

Mittleres Löschfahrzeug
type: Class
equivalent class: Staffellöschfahrzeug 10/6
subclass of: Feuerlöschfahrzeug mit fest eingebauter Feuerlöschpumpe
comment: Ein Löschfahrzeug mit Gruppenbeladung für die Brandbekämpfung in der ersten Welle oder für technische Hilfeleistung im kleinen bis mittleren Rahmen
comment: Fire engine to transport a whole group of fire fighters for fire-fighting in the first wave or for technical assistance on a small to medium scale @en
label: Mittleres Löschfahrzeug (Germany) @en

Messleitwagen
type: Class
subclass of: Feuerwehrfahrzeug
subclass of: Landfahrzeug
comment: Feuerwehrfahrzeug zum Aufspüren und Bestimmen von gefährlichen Stoffen; Führungsfahrzeug im Rahmen des ABC-Zuges
comment: Fire-fighting vehicle for detecting and identifying hazardous substances; incident command vehicle within a CBRN unit @en
label: Messleitwagen (Germany) @en

Mannschaftstransportfahrzeug
type: Class
subclass of: Feuerwehrfahrzeug
subclass of: Mannschaftstransportwagen
comment: Feuerwehrfahrzeug zum Transport von Personengruppen
comment: Fire-fighting vehicle to transport groups of people @en
label: Mannschaftstransportfahrzeug (Germany) @en

Mannschaftstransportwagen
type: Class
subclass of: Einsatzfahrzeug
subclass of: Landfahrzeug
comment: Einsatzfahrzeug zum Transport von Personengruppen
comment: Emergency vehicle to transport groups of people @en
label: Mannschaftstransportwagen (Germany) @en

Mehrzweckanhänger
type: Class
subclass of: Anhänger
comment: Anhänger der flexibel je nach Einsatzlage verschiedenste Materialien transportieren kann
comment: Trailer that can flexibly transport a variety of materials depending on the application @en
label: Mehrzweckanhänger (Germany) @en

Mehrzweckfahrzeug
type: Class
subclass of: Einsatzfahrzeug
subclass of: Class
  union of: Feuerwehrfahrzeug
  union of: Rettungsfahrzeug
comment: Entweder ein ein Feuerwehreinsatzfahrzeug, das im Einsatzfall verschiedene Aufgaben wahrnehmen kann und in aller Regel eine umfangreichere Beladung hat und eher auf den Materialtransport ausgelegt ist, oder ein Rettungswagen, der sowohl zur Notfallrettung als auch zum Krankentransport eingesetzt werden kann
comment: Multipurpose emergency vehicle; either a fire-fighting vehicle that contains more equipment than a Mannschaftstransportfahrzeug (MTF), or a rescue vehicle combining the functionalities of a Rettungswagen (RTW) and a Krankentransportwagen (KTW) @en
label: Mehrzweckfahrzeug (Germany) @en

Handquittung/Fremdanmeldung
type: Class
subclass of: Einsatzfahrzeugszustand
IAO_0000116: status 9 (pol/feu/san)
label: Manual ACK / Remote Login @en

Manueller Antrieb
type: Class
subclass of: Antrieb
label: Manual propulsion @en

Nachricht
type: Class
subclass of: IAO_0000030
subclass of: Entity
label: Message @en

Schadensminderung
type: Class
subclass of: Verringerung
comment: Process of reducting harm @en
comment: Vorgang der Verringerung von Schäden
label: Mitigation @en

Notarztwagen
type: Class
subclass of: Rettungswagen
comment: A Rettungswagen (Germany) with an emergency doctor @en
comment: Ein Rettungswagen, der mit einem Notart besetzt ist
label: Notarztwagen (Germany) @en

Notarzteinsatzfahrzeug
type: Class
subclass of: Landfahrzeug
subclass of: Rettungsfahrzeug
comment: A specially equipped car for the transport of an emergency doctor @en
comment: Ein besonders ausgerüsteter PKW für den Transport eines Notarztes
label: Notarzteinsatzfahrzeug (Germany) @en

Notarzteinsatzhubschrauber
type: Class
subclass of: Aircraft
subclass of: Rettungsfahrzeug
comment: Rescue air vehicle to transport an emergency doctor @en
comment: Rettungsluftfahrzeug für den Transport eines Notarztes
label: Notarzteinsatzhubschrauber (Germany) @en

Notfallkrankentransportwagen
type: Class
equivalent class: Notfalltransportwagen
subclass of: Landfahrzeug
subclass of: Rettungsfahrzeug
comment: Rescue vehicle for the transport, first aid and monitoring of patients @en
comment: Rettungsfahrzeug für den Transport, die Erstversorgung und die Überwachung von Patienten
label: Notfallkrankentransportwagen (Germany) @en

Notfalltransportwagen
type: Class
subclass of: Landfahrzeug
subclass of: Rettungsfahrzeug
label: Notfalltransportwagen (Germany) @en

Benachrichtigungsereignis
type: Class
subclass of: BFO_0000003
subclass of: Class
  intersection of: BFO_0000003
  intersection of: Restriction
    some values from: IAO_0000030
    on property: hat Benachrichtigung
  intersection of: Restriction
    some values from: BFO_0000023
    on property: hat Addressat für Benachrichtigung
comment: An occurrent describing the publication of a notification, addressed to a target group of individuals grouped by a certain role. @en
comment: Ein Ereignis, das die Veröffentlichung einer Benachrichtigung beschreibt, die an eine Gruppe von Individuen gerichtet ist, die durch eine Rolle zusammengefasst werden.
label: Notification event @en

Einsatzmittel
type: Class
subclass of: BFO_0000004
comment: Alle Ressourcen, die in einem Einsatz administriert werden können, seien sie menschlicher, technischer, infrastruktureller oder materieller Natur
comment: Any resource that can be deployed in an emergency response, whether human, technical, infrastructural, or material @en
label: Operational resource @en

Nicht einsatzbereit auf Wache
type: Class
subclass of: Einsatzfahrzeugszustand
IAO_0000116: status 6 (rd/fw/pol)
label: Out of service at station @en

Versorgung von Wachkomapatienten
type: Class
subclass of: Anlage
comment: Facility that is specialized in care for patients in a persistent vegetative state (PVS) @en
label: PVS patient care unit @en

Polizeifahrzeug
type: Class
subclass of: Einsatzfahrzeug
label: Police vehicle @en

Position
type: Class
subclass of: BFO_0000011
comment: A spatiotemporal region that has a zero-dimensional temporal component, i.e., a time instant, and a zero-dimensional spatial component, i.e., a point, hence forming a point in space-time @en
comment: Ein Raum-Zeit-Bereich mit einem nulldimensionalen temporalen Anteil (d.h., einem Zeitpunkt) und einem nulldimensionalen räumlichen Anteil (d.h. ein räumlicher Punkt), der also insgesamt einen Raum-Zeit-Punkt darstellt.

Priorisierter Sprechwunsch
type: Class
subclass of: Einsatzfahrzeugszustand
IAO_0000116: status 0 (pol)
label: Proritized request to talk @en

Antrieb
type: Class
subclass of: BFO_0000015
comment: Process that generates force leading to movement @en
comment: Prozess der zu Bewegung führt
label: Propulsion @en

Pumpwerk
type: Class
subclass of: Wasserbauwerk
label: Pumping station @en

Rüstlöschfahrzeug (Österreich)
type: Class
subclass of: Feuerwehrfahrzeug
subclass of: Landfahrzeug
comment: Feuerwehrfahrzeug, das sowohl für den technischen als auch für den Brandeinsatz ausgerüstet ist
comment: Firefighting vehicle equipped for both technical and firefighting operations @en
label: Rüstlöschfahrzeug (Austria) @en

Rettungstransporthubschrauber
type: Class
subclass of: Aircraft
subclass of: Rettungsfahrzeug
comment: Rescue air vehicle specially equipped for air rescue and the transfer of hospital patients @en
comment: Rettungsluftfahrzeug speziell ausgerüstete für die Luftrettung und die Verlegung von Klinikpatienten
label: Rettungstransporthubschrauber (Germany) @en

Rettungswagen
type: Class
subclass of: Landfahrzeug
subclass of: Rettungsfahrzeug
comment: Rescue vehicle with crew and medical equipment for the care, monitoring and transport of emergency patients @en
comment: Rettungsfahrzeug mit Besatzung und medizinisch-technischer Ausstattung für die Versorgung, Überwachung und den Transport von Notfallpatienten
label: Rettungswagen (Germany) @en

Rüstwagen
type: Class
subclass of: Rüstfahrzeug
comment: Feuerwehrfahrzeug zur Bereitstellung von umfangreichen Werkzeug und Spezialgerät zum Befreien von Personen nach Unfällen, Auffangen von umweltschädigende Substanzen, ausleuchten von Einsatzstellen und für diverse andere Aufgaben
comment: Fire-fightung vehicle for the provision of extensive tools and special equipment for freeing people after accidents, collecting environmentally harmful substances, illuminating emergency sites and for various other tasks @en
label: Rüstwagen (Germany) @en

Rüstwagen mit Sonderbeladung Gefahrgut
type: Class
subclass of: Rüstfahrzeug
comment: Rüstwagen (Germany) with an extensive equipment for hazardous materials @en
comment: Rüstwagen mit umfangreicher Gefahrgutausrüstung
label: Rüstwagen mit Sonderbeladung Gefahrgut (Germany) @en

Rüstwagen 1
type: Class
subclass of: Rüstfahrzeug
comment: Rüstwagen (Germany) with maximum permissible weight of 9 tons @en
comment: Rüstwagen mit zulässigem Gesamtgewicht von 9 Tonnen
label: Rüstwagen 1 (Germany) @en

Rüstwagen 2
type: Class
subclass of: Rüstfahrzeug
comment: Rüstwagen (Germany) with maximum permissible weight of 12 tons @en
comment: Rüstwagen mit zulässigem Gesamtgewicht von 12 Tonnen
label: Rüstwagen 2 (Germany) @en

Rüstwagen 3
type: Class
subclass of: Rüstfahrzeug
comment: Ein Rüstwagen, der größer ist als der Rüstwagen 2
comment: Rüstwagen (Germany) that is bigger than a Rüstwagen 2 (Germany) @en
label: Rüstwagen 3 (Germany) @en

Verringerung
type: Class
subclass of: Veränderung
comment: Die Verringerung einer bestimmten Beschaffenheit oder Qualität
comment: The decrease of a given quality @en
label: Reduction @en

Ersuchsereignis
type: Class
subclass of: BFO_0000003
comment: Act of asking for something @en
comment: Vorgang des Erbittens von etwas
label: Request event @en

Lebensmittelersuchsereignis
type: Class
subclass of: Hilfeersuchsereignis
comment: Act of asking for food @en
comment: Vorgang des Erbittens von Lebensmitteln
label: Request for food event @en

Hilfeersuchsereignis
type: Class
subclass of: Ersuchsereignis
comment: Act of asking for help @en
comment: Vorgang des Erbittens von Hilfe
label: Request for help event @en

Ersuchsereignis für medizinische Versorgung
type: Class
subclass of: Hilfeersuchsereignis
comment: Act of asking for medical supplies @en
comment: Vorgang des Erbittens von medizinischer Versorgung
label: Request for medical supplies event @en

Unterkunftsersuchsereignis
type: Class
subclass of: Hilfeersuchsereignis
comment: Act of asking for shelter @en
comment: Vorgang des Erbittens einer Unterkunft
label: Request for shelter event @en

Trinkwasserersuchsereignis
type: Class
subclass of: Hilfeersuchsereignis
comment: Act of asking for drinking water @en
comment: Vorgang des Erbittens von Trinkwasser
label: Request for water event @en

Sprechwunsch
type: Class
subclass of: Einsatzfahrzeugszustand
IAO_0000116: status 5 (rd/fw/pol)
label: Request to talk @en

Rüstfahrzeug
type: Class
subclass of: Feuerwehrfahrzeug
subclass of: Landfahrzeug
label: Rescue appliance @en

Rettungsfahrzeug
type: Class
subclass of: Einsatzfahrzeug
label: Rescue vehicle @en

Pflegeeinrichtung
type: Class
subclass of: Anlage
comment: Anlage für die Langzeitpflege und Betreuung
comment: Long-term care facility providing supervision and assistance @en
label: Residential facility @en

Wachanfahrt/Rückfahrt
type: Class
subclass of: Einsatzfahrzeugszustand
IAO_0000116: status 9 (rd/fw/pol)
label: Returning to station @en

Schwerlast-Rettungswagen
type: Class
subclass of: Landfahrzeug
subclass of: Rettungsfahrzeug
comment: Rescue vehicle for the transport of overweight patients @en
comment: Rettungsfahrzeug für den Transport von übergewichtigen Patienten
label: Schwerlast-Rettungswagen (Germany) @en

Schlauchtransportanhänger
type: Class
subclass of: Anhänger
comment: Feuerwehranhänger für den Transport von Feuerwehrschläuchen und Zubehör
comment: Fire service trailer for the transport of fire hoses and accessories @en
label: Schlauchtransportanhänger (Germany) @en

Schlauchwagen
type: Class
subclass of: Feuerwehrfahrzeug
subclass of: Landfahrzeug
comment: Feuerwehrfahrzeug für den Nachschub von Druckschläuchen und Armaturen sowie zum Verlegen von Druckschläuchen über lange Strecken
comment: Fire-fighting vehicle for the supply of pressure hoses and fittings as well as for laying pressure hoses over long distances @en
label: Schlauchwagen (Germany) @en

Schlauchwagen für den Katastrophenschutz
type: Class
subclass of: Schlauchwagen
comment: Schlauchwagen (Germany) equipped with a portable pump with a nominal flow rate of 1500 litres per minute at 10 bar nominal pressure, for use primarily in disaster control (especially in conjunction with the Löschgruppenfahrzeug 20 für den Katastrophenschutz (Germany)) @en
comment: Schlauchwagen mit einer Tragkraftspritze mit einer Nennförderleistung von 1500 Litern pro Minute bei 10 bar Nennförderdruck für den Einsatz, der vorrangig für den Katstrophenschutz eingesetzt wird (insb. in Verbindung mit dem Löschgruppenfahrzeug 20 für den Katastrophenschutz)
label: Schlauchwagen für den Katastrophenschutz (Germany) @en

Schlauchwagen 1000
type: Class
subclass of: Schlauchwagen
comment: Kleinere Ausführung eines Schlauchwagens
comment: Smaller version of a Schlauchwagen (Germany) @en
label: Schlauchwagen 1000 (Germany) @en

Schlauchwagen 2000
type: Class
subclass of: Schlauchwagen
comment: Bigger version of a Schlauchwagen (Germany) @en
comment: Größere Ausführung eines Schlauchwagens
label: Schlauchwagen 2000 (Germany) @en

Schlauchwagen 2000 mit Truppbesatzung
type: Class
subclass of: Schlauchwagen
comment: Schlauchwagen (Germany) that can accomodate am independent crew @en
comment: Schlauchwagen der einen selbständigen Trupp aufnehmen kann
label: Schlauchwagen 2000 mit Truppbesatzung (Germany) @en

Anhänger mit Schaum-Wasserwerfer
type: Class
subclass of: Feuerwehrfahrzeug
subclass of: Anhänger
comment: Anhänger für den Transport eines Schaum-Wasserwerfers und 220 l Schaummittel
comment: Trailer for transporting a foam water cannon and 220 liters of foam agent @en
label: Anhänger mit Schaum-Wasserwerfer (Germany) @en

Sandsackwall
type: Class
subclass of: Wasserbauwerk
label: Sandbag wall @en

Geschlossener Wohnbereich
type: Class
subclass of: Anlage
label: Secure residential unit @en

Sensormesswert
type: Class
subclass of: IAO_0000109
comment: A sensor reading is a mesurement datum that is a recording of the output of a sensor. @en
comment: Ein Sensormesswert ist ein Messwert, der auf der Ausgabe eines Sensors basiert.
label: Sensor reading @en

Schiebetor
type: Class
subclass of: Flutschutztor
label: Sliding flood gate @en

Social-Media-Post
type: Class
subclass of: IAO_0000030
comment: Veröffentlichung auf einer Social-Media-Plattform
comment: entry on a social media platform @en
label: Social media post @en

Soziale Unterstützung
type: Class
subclass of: Intensionale menschliche Aktivität
comment: Process of assisting and encouraging other individuals @en
comment: Vorgang des Beistehens und Zusprechens anderer Individuen
label: Social support @en

Staffellöschfahrzeug
type: Class
subclass of: Feuerlöschfahrzeug mit fest eingebauter Feuerlöschpumpe
comment: Ein Löschfahrzeug mit Gruppenbeladung für die Brandbekämpfung in der ersten Welle oder für technische Hilfeleistung im kleinen bis mittleren Rahmen
comment: Fire engine to transport a whole group of fire fighters for fire-fighting in the first wave or for technical assistance on a small to medium scale @en
label: Staffellöschfahrzeug (Germany) @en

Staffellöschfahrzeug 10/6
type: Class
subclass of: Staffellöschfahrzeug
label: Staffellöschfahrzeug 10/6 (Germany) @en

Staffellöschfahrzeug 20
type: Class
subclass of: Staffellöschfahrzeug
comment: Staffellöschfahrzeug (Germany) with a fire-fighting centrifugal pump with a capacity of 2,000 liters of water per minute @en
comment: Staffellöschfahrzeug mit einer Feuerlöschkreiselpumpe mit einer Förderleistung von 2.000 Liter Wasser in der Minute
label: Staffellöschfahrzeug 20 (Germany) @en

Dammbalken
type: Class
subclass of: Wasserbauwerk
label: Stoplog @en

Drehtor
type: Class
subclass of: Flutschutztor
label: Swing-hinged flood gate @en

Taucheinsatzfahrzeug
type: Class
subclass of: Gerätewagen
label: Taucheinsatzfahrzeug (Germany) @en

Tanklöschfahrzeug
type: Class
subclass of: Feuerlöschfahrzeug mit fest eingebauter Feuerlöschpumpe
comment: Fire engine usually with a permanently installed fire pump and a large extinguishing water tank, which allows initial fire fighting over a certain period of time without an external water supply @en
comment: Löschfahrzeug mit einer in der Regel fest eingebauten Feuerlöschpumpe und einem großen Löschwasserbehälter, der eine erste Brandbekämpfung über einen bestimmten Zeitraum ohne externe Löschwasserversorgung erlaubt
label: Tanklöschfahrzeug (Germany) @en

Tanklöschfahrzeug 16/24 mit Truppbesatzung
type: Class
subclass of: Tanklöschfahrzeug
comment: Tanklöschfahrzeug (Germany) that can accommodate an independent crew @en
comment: Tanklöschfahrzeug das einen selbstständigen Trupp aufnehmen kann
label: Tanklöschfahrzeug 16/24 mit Truppbesatzung (Germany) @en

Tanklöschfahrzeug 16/25
type: Class
subclass of: Tanklöschfahrzeug
comment: Tanklöschfahrzeug (Germany) with a water tank of 2,400 liters capacity @en
comment: Tanklöschfahrzeug mit einen Wassertank von mindestens 2.400 Litern Inhalt
label: Tanklöschfahrzeug 16/25 (Germany) @en

Tanklöschfahrzeug 20/40
type: Class
subclass of: Tanklöschfahrzeug
comment: Tanklöschfahrzeug (Germany) with a water tank of at least 4,000 liters capacity, a supply of 120 liters of foam agent, and a fire extinguishing centrifugal pump with a flow rate of 2,000 liters of water per minute at an output pressure of 10 bar @en
comment: Tanklöschfahrzeug mit einen Wassertank von mindestens 4.000 Litern Inhalt, einem Vorrat von mindestens 120 Liter Schaummittel und einer Feuerlöschkreiselpumpe mit einer Förderleistung von 2.000 Liter Wasser in der Minute bei einem Ausgangsdruck von 10 bar
label: Tanklöschfahrzeug 20/40 (Germany) @en

Tanklöschfahrzeug 20/40 mit Sonderlöschmittel
type: Class
subclass of: Tanklöschfahrzeug
comment: Tanklöschfahrzeug (Germany) with a water tank of at least 4,000 liters capacity, a supply of at least 500 liters of foam agent, a fire extinguishing centrifugal pump with a flow rate of 2,000 liters of water per minute at an output pressure of 10 bar, and a foam water canon @en
comment: Tanklöschfahrzeug mit einen Wassertank von mindestens 4.000 Litern Inhalt, einem Vorrat von mindestens 500 Liter Schaummittel, einer Feuerlöschkreiselpumpe mit einer Förderleistung von 2.000 Liter Wasser in der Minute bei einem Ausgangsdruck von 10 bar, und einem Schaum-Wasserwerfer
label: Tanklöschfahrzeug 20/40 mit Sonderlöschmittel (Germany) @en

Tanklöschfahrzeug 2000
type: Class
subclass of: Tanklöschfahrzeug
comment: Tanklöschfahrzeug (Germany) with a water tank of 2,000 liters capacity, a supply of 6 kg of extinguishing powder, and a fire extinguishing centrifugal pump with a flow rate of 1,000 liters of water per minute at an output pressure of 10 bar @en
comment: Tanklöschfahrzeug mit einen Wassertank von mindestens 2.000 Litern Inhalt, 6 kg Löschpulver, und einer Feuerlöschkreiselpumpe mit einer Förderleistung von 1.000 Liter Wasser in der Minute bei einem Ausgangsdruck von 10 bar
label: Tanklöschfahrzeug 2000 (Germany) @en

Tanklöschfahrzeug 24/50
type: Class
subclass of: Tanklöschfahrzeug
comment: Tanklöschfahrzeug (Germany) with a water tank of 5,000 liters capacity, a supply of 500 liters of foam agent, and a foam water canon @en
comment: Tanklöschfahrzeug mit einen Wassertank von mindestens 5.000 Litern Inhalt, einem Vorrat von 500 Liter Schaummittel und einem Schaum-Wasserwerfer
label: Tanklöschfahrzeug 24/50 (Germany) @en

Tanklöschfahrzeug 3000
type: Class
subclass of: Tanklöschfahrzeug
comment: Tanklöschfahrzeug (Germany) with a water tank of 3,000 liters capacity, a supply of 120 liters of foam agent as well as 12 kg of extinguishing powder, and a fire extinguishing centrifugal pump with a flow rate of 2,000 liters of water per minute at an output pressure of 10 bar @en
comment: Tanklöschfahrzeug mit einen Wassertank von mindestens 3.000 Litern Inhalt, einem Vorrat von 120 Liter Schaummittel sowie 12 kg Löschpulver, und einer Feuerlöschkreiselpumpe mit einer Förderleistung von 2.000 Liter Wasser in der Minute bei einem Ausgangsdruck von 10 bar
label: Tanklöschfahrzeug 3000 (Germany) @en

Tanklöschfahrzeug 4000
type: Class
subclass of: Tanklöschfahrzeug
comment: Tanklöschfahrzeug (Germany) with a water tank of at least 4,000 liters capacity, a supply of at least 500 liters of foam agent as well as 12 kg of extinguishing powder, and a fire extinguishing centrifugal pump with a flow rate of 2,000 liters of water per minute at an output pressure of 10 bar @en
comment: Tanklöschfahrzeug mit einen Wassertank von mindestens 4.000 Litern Inhalt, einem Vorrat von mindestens 500 Liter Schaummittel sowie 12 kg Löschpulver, und einer Feuerlöschkreiselpumpe mit einer Förderleistung von 2.000 Liter Wasser in der Minute bei einem Ausgangsdruck von 10 bar
label: Tanklöschfahrzeug 4000 (Germany) @en

Tragkraftspritzenanhänger
type: Class
subclass of: Feuerwehrfahrzeug
subclass of: Anhänger
comment: A closed trailer, usually single-axle, equipped with a portable pump. @en
comment: Ein, in der Regel einachsiger, geschlossener Anhänger der Feuerwehr, der mit einer Tragkraftspritze ausgestattet ist.
label: Tragkraftspritzenanhänger (Germany) @en

Tragkraftspritzenfahrzeug
type: Class
subclass of: Feuerlöschfahrzeug mit mobiler Feuerlöschpumpe
subclass of: Landfahrzeug
comment: A fire-fighting vehicle equipped with a portable pump @en
comment: Ein Feuerwehrfahrzeug, das mit einer Tragkraftspritze ausgestattet ist
label: Tragkraftspritzenfahrzeug (Germany) @en

Tragkraftspritzenfahrzeug mit Wasser
type: Class
subclass of: Tragkraftspritzenfahrzeug
comment: Tragkraftspritzenfahrzeug (Germany) with own water tank of at least 500 liters capacity @en
comment: Tragkraftspritzenfahrzeug mit eigenem Löschwassertank von mindestens 500 Litern Fassungsvermögen
label: Tragkraftspritzenfahrzeug mit Wasser (Germany) @en

Sperrwerk
type: Class
subclass of: Wasserbauwerk
label: Tidal barrier @en

Anhänger
type: Class
subclass of: Landfahrzeug
label: Trailer @en

Drehleiter
type: Class
subclass of: Hubrettungsfahrzeug
comment: Feuerwehrfahrzeug mit einer fest installierten Leiter, die sich um 360 Grad drehen lässt
comment: Fire-fighting vehicle with a ladder mounted on a pivot which resembles a turntable, able to rotate 360 degrees @en
label: Turntable ladder @en

Versorgungslastkraftwagen
type: Class
subclass of: Feuerwehrfahrzeug
subclass of: Gerätewagen
comment: Fire-fighting vehicle to transport material and equipment to provide support in various operational situations @en
comment: Gerätewagen der Feuerwehr für den Transport von Material und Ausrüstung zur Bewältigung verschiedener Einsatzlagen
label: Versorgungslastkraftwagen (Germany) @en

Verkehrssicherungsanhänger
type: Class
subclass of: Anhänger
comment: Anhänger für den Transport von Verkehrsleitkegeln, Leitkegelleuchten, Winkerkellen usw. um Verkehrsteilnehmer zu warnen oder den Verkehr umzuleiten oder zu stoppen
comment: Trailer for the transport of traffic cones, traffic cone lights, signal lights, etc. to warn road users or to divert or stop traffic @en
label: Verkehrssicherungsanhänger (Germany) @en

Fahrzeug
type: Class
subclass of: BFO_0000030
label: Vehicle @en

Hubtor
type: Class
subclass of: Flutschutztor
label: Vertical-lift flood gate @en

Videoaufnahme
type: Class
subclass of: IAO_0000030
comment: An information content entity that contains audiovisual information @en
comment: Informationsinhalt, der audiovisuelle Inhalte umfasst
label: Video @en

Freiwilligenkampagne
type: Class
subclass of: Kampagne
comment: A campaign with the goal of recruiting volunteers for a defined purpose @en
comment: Eine Kampagne mit dem Ziel, Freiwille für einen bestimmten Zweck zu rekrutieren
label: Volunteering campaign @en

Wechselladerfahrzeug
type: Class
subclass of: Feuerwehrfahrzeug
subclass of: Landfahrzeug
comment: Feuerwehrfahrzeug für den Transport von in oder auf austauschbaren Abrollbehältern verlasteten, feuerwehrtechnischen Einsatzmitteln
comment: Firefighting vehicle for the transport of firefighting equipment loaded in or on interchangeable roll-off containers @en
label: Wechselladerfahrzeug (Germany) @en

Wasserrettungswagen
type: Class
subclass of: Gerätewagen
label: Wasserrettungswagen (Germany) @en

Schöpfwerk
type: Class
subclass of: Wasserbauwerk
label: Water pumping station @en

Wasserfahrzeug
type: Class
subclass of: Fahrzeug
comment: Fahrzeug, das auscchließlich oder überwiegend auf dem Wasser unterwegs ist
comment: Vehicle that travels exclusively or predominantly on water @en
label: Watercraft @en

Vollautomatische Drehleiter mit Korb
type: Class
subclass of: Vollautomatische Drehleiter
comment: Turntable ladder with a basket and an automated erection and support process @en
comment: Vollautomatische Drehleiter mit Korb
label: Vollautomatische Drehleiter mit Korb (Germany) @en

Vollautomatische Drehleiter mit Korb 12/9
type: Class
subclass of: Vollautomatische Drehleiter mit Korb
comment: Turntable ladder with a basket and an automated erection and support process that has a nominal rescue height of 12 meters, and a nominal outreach of 9 meters @en
comment: Vollautomatische Drehleiter mit Korb und einer Nennrettungshöhe von 12 Metern bei 9 Metern Nennausladung
label: Vollautomatische Drehleiter mit Korb 12/9 (Germany) @en

Vollautomatische Drehleiter mit Korb 18/12
type: Class
subclass of: Vollautomatische Drehleiter mit Korb
comment: Turntable ladder with a basket and an automated erection and support process that has a nominal rescue height of 18 meters, and a nominal outreach of 12 meters @en
comment: Vollautomatische Drehleiter mit Korb und einer Nennrettungshöhe von 18 Metern bei 12 Metern Nennausladung
label: Vollautomatische Drehleiter mit Korb 18/12 (Germany) @en

Vollautomatische Drehleiter mit Korb 23/12
type: Class
subclass of: Vollautomatische Drehleiter mit Korb
comment: Turntable ladder with a basket and an automated erection and support process that has a nominal rescue height of 23 meters, and a nominal outreach of 12 meters @en
comment: Vollautomatische Drehleiter mit Korb und einer Nennrettungshöhe von 23 Metern bei 12 Metern Nennausladung
label: Vollautomatische Drehleiter mit Korb 23/12 (Germany) @en

Sequentielle Drehleiter mit Korb
type: Class
subclass of: Sequenzielle (halbautomatische) Drehleiter
comment: Sequentielle Drehleiter mit Korb
comment: Turntable ladder with a basket that can only perform one movement at a time @en
label: Sequentielle Drehleiter mit Korb (Germany) @en

Sequentielle Drehleiter mit Korb 12/9
type: Class
subclass of: Sequentielle Drehleiter mit Korb
comment: Sequentielle Drehleiter mit Korb und einer Nennrettungshöhe von 12 Metern bei 9 Metern Nennausladung
comment: Turntable ladder with a basket that can only perform one movement at a time, and which has a nominal rescue height of 12 meters, and a nominal outreach of 9 meters @en
label: Sequentielle Drehleiter mit Korb 12/9 (Germany) @en

Sequentielle Drehleiter mit Korb 18/12
type: Class
subclass of: Sequentielle Drehleiter mit Korb
comment: Sequentielle Drehleiter mit Korb und einer Nennrettungshöhe von 18 Metern bei 12 Metern Nennausladung
comment: Turntable ladder with a basket that can only perform one movement at a time, and which has a nominal rescue height of 18 meters, and a nominal outreach of 12 meters @en
label: Sequentielle Drehleiter mit Korb 18/12 (Germany) @en

Sequentielle Drehleiter mit Korb 23/12
type: Class
subclass of: Sequentielle Drehleiter mit Korb
comment: Sequentielle Drehleiter mit Korb und einer Nennrettungshöhe von 23 Metern bei 12 Metern Nennausladung
comment: Turntable ladder with a basket that can only perform one movement at a time, and which has a nominal rescue height of 23 meters, and a nominal outreach of 12 meters @en
label: Sequentielle Drehleiter mit Korb 23/12 (Germany) @en

Löschfahrzeug
type: Class
subclass of: Feuerlöschfahrzeug
comment: Feuerlöschfahrzeug, das mit einer Feuerlöschpumpe nach EN 1028-1 und EN 1028-2 und im Regelfall mit einem Wasserbehälter und anderen zusätzlichen Geräten für die Brandbekämpfung ausgerüstet ist.
comment: Fire engine equipped with a fire pump in accordance with EN 1028-1 and EN 1028-2 and, usually, with a water tank and other additional equipment for firefighting. @en
label: Löschfahrzeug (Germany) @en

Mehrzweckboot (Feuerwehr)
type: Class
subclass of: Feuerwehrfahrzeug
subclass of: Wasserfahrzeug
comment: Feuerwehrboot für die Rettung und Bergung von Personen, Tieren und Gütern, notfallmedizinische Versorgung auf Booten und bewohnten Inseln, Brandbekämpfung auf dem Wasser und auf Inseln, Niederschlagen von Dämpfen, Tauchereinsatz, technische Hilfeleistungen, Schadensbekämpfung bei Ölunfällen und Transport von Personen und Einsatzmitteln
comment: Firefighting boat for the rescue and recovery of people, animals and goods, emergency medical care on boats and inhabited islands, firefighting on water and on islands, vapor suppression, diving operations, technical assistance, damage control in the event of oil spills and transport of people and emergency equipment @en
label: Mehrzweckboot (Feuerwehr) (Germany) @en

Nicht einsatzbereit über Funk
type: Class
subclass of: Einsatzfahrzeugszustand
IAO_0000116: status 7 (fw/pol)
comment: Not operational, away from station (e.g. technical defect) @en
label: Out of service (mobile) @en

Rettungsboot Typ 1 (Feuerwehr)
type: Class
subclass of: Rettungsboot (Feuerwehr)
comment: Kleines Rettungsboot der Feuerwehr mit optionaler Motorisierung für den Einsatz in stehenden Gewässern
comment: Small rescue boat with optional motorization for use in stagnant waters @en
label: Rettungsboot Typ 1 (Feuerwehr) (Germany) @en

Rettungsboot Typ 2 (Feuerwehr)
type: Class
subclass of: Rettungsboot (Feuerwehr)
comment: Größeres Rettungsboot der Feuerwehr mit Motorisierung für den Einsatz in fließenden und offenen Gewässern
comment: Larger rescue boat with motorization for use in flowing and open waters @en
label: Rettungsboot Typ 2 (Feuerwehr) (Germany) @en

Rettungsboot (Feuerwehr)
type: Class
subclass of: Feuerwehrfahrzeug
subclass of: Wasserfahrzeug
comment: Feuerwehrboot zur Rettung von Menschen und Tieren
comment: Fireboat for rescuing people and animals @en
label: Rettungsboot (Feuerwehr) (Germany) @en

Splitte auf
type: NamedIndividual
type: Function
comment: Benutzerdefinierte RML-Funktion, die einen Eingabe-String entgegen nimmt und ihn n mal an Leerzeichen splittet (wobei n ein Eingabeparameter ist), und den i-ten Teil zurück gibt (wobei i ein weiterer Eingabeparameter ist und 0 den ersten Teilstring addressiert).
comment: Custom RML function that takes an input sting, splits it on white spaces n times (where n is a call parameter), and returns the i-th part (where i is another call parameter and 0 refers to the first part). @en
label: Split @en

Airbus Operations GmbH
type: NamedIndividual
type: Gewerbebetrieb

Gebietsname
type: NamedIndividual
type: Parameter
label: Area name @en

Aurubis
type: NamedIndividual
type: Gewerbebetrieb

Bezirksamt Bergedorf (Hamburg)
type: NamedIndividual
type: Bezirksamt

Base-64-String
type: NamedIndividual
type: Parameter
comment: String containing content encoded in the base64 format @en
comment: String, mit base6-encodierten Inhalt
label: Base-64 string @en

Bergedorf (Deichverteidigungsgebiet)
type: NamedIndividual
type: Deichverteidigungsgebiet
label: Bergedorf (dike defense area) @en

Behörde für Inneres und Sport (BIS) (Hamburg)
type: NamedIndividual
type: Landesbehörde (Deutschland)

Behörde für Justiz und Verbraucherschutz (BJV) (Hamburg)
type: NamedIndividual
type: Landesbehörde (Deutschland)

Behörde für Kultur und Medien (BKM) (Hamburg)
type: NamedIndividual
type: Landesbehörde (Deutschland)

Behörde für Stadtentwicklung und Wohnen (BSW) (Hamburg)
type: NamedIndividual
type: Landesbehörde (Deutschland)

Behörde für Umwelt, Klima, Energie und Agrarwirtschaft (BUKEA) (Hamburg)
type: NamedIndividual
type: Landesbehörde (Deutschland)

Behörde für Verkehr und Mobilitätswende (BVM) (Hamburg)
type: NamedIndividual
type: Landesbehörde (Deutschland)

Behörde für Wissenschaft, Forschung, Gleichstellung und Bezirke (BWFGB) (Hamburg)
type: NamedIndividual
type: Landesbehörde (Deutschland)

Behörde für Wirtschaft und Innovation (Hamburg)
type: NamedIndividual
type: Landesbehörde (Deutschland)

Klassen-IRI
type: NamedIndividual
type: Parameter
label: Class IRI @en

CSV-String
type: NamedIndividual
type: Parameter
comment: String containing multiple values, separated by commas @en
comment: String, der mehrere Werte enthält, die durch Kommas abgetrennt sind
label: CSV string @en

Date-Time-Stamp-String
type: NamedIndividual
type: Parameter
comment: Date-Time-Stamp-String mit oder ohne Zeitzoneninformation
comment: Date-time stamp string with or without time zone information @en
label: Date-time stamp string @en

Datei herunterladen und RESCUE-MATE-URL zurückgeben
type: NamedIndividual
type: Function
comment: Benutzerdefinierte RML-Funktion die eine Datei von einem gegebenen URL herunterlädt, sie in der RESCUE-MATE-Datenplattform speichert und einen plattforminternen URL zurückgibt, unter dem die Datei über die RESCUE-MATE-Datenplattform zu erreichen ist
comment: Custom RML function that downloads a file from a given URL, stores it in the RESCUE-MATE data platform, and returns the URL where to access it via the RESCUE-MATE data platform. @en
label: Download file and return RESCUE-MATE URL @en

E-Mail-Adress-String
type: NamedIndividual
type: Parameter
comment: String containing an e-mail address @en
comment: String, der eine E-Mail-Adresse enthält
label: E-mail address string @en

Ereigniskategorie
type: NamedIndividual
type: Parameter
comment: A string containing an ID for a event category @en
comment: Ein String, der die ID einer Ereigniskategorie enthält
label: Event category @en

Finanzbehörde (Hamburg)
type: NamedIndividual
type: Landesbehörde (Deutschland)

Bauwerkstypname
type: NamedIndividual
type: Parameter
comment: String containing the fixed construction type @en
comment: String, der den Namen eines Bauwerkstyps enthält
label: Fixed construction type name @en

Name zu Ressourcen-IRI
type: NamedIndividual
type: Function
comment: Benutzerdefinierte RML-Funktion, die eine IRI im RESCUE-MATE-Ressourcen-Namensraum für eine ID oder einen Namen generiert
comment: Custom RML function that generates a proper IRI in the RESCUE-MATE resource namespace for an input ID string @en
label: Generate resource IRI @en

GeoJSON zu WKT-Linienzug
type: NamedIndividual
type: Function
comment: Benutzerdefinierte RML-Funktion, die eine Liste von Punkt-Repräsentationen einer GeoJSON-Datei entgegennimmt und einen WKT-Line-String zurückgibt.
comment: Custom RML function that takes a list of point strings as input and returns a WKT string for the line string geometry represented by the input GeoJSON data @en
label: GeoJSON to WKT line string @en

GeoJSON zu Multi-Linienzug
type: NamedIndividual
type: Function
comment: Benutzerdefinierte RML-Funktion, die eine Liste von Linienzügen aus einer GeoJSON-Datei entgegennimmt und einen WKT-Multi-Line-String zurückgibt
comment: Custom RML function that takes a list of line strings as input and returns a WKT string for the multi line string geometry represented by the input GeoJSON data @en
label: GeoJSON to WKT Multi-Line String @en

GeoJSON zu WKT Multi-Punkt
type: NamedIndividual
type: Function
comment: Benutzerdefinierte RML-Funktion, die eine Liste mit GeoJSON-Punkt-Repräsentationen entgegennimmt und einen Multi-Punkt-WKT-String zurückgibt.
comment: Custom RML function that takes a list of point strings as input and returns a WKT string for the multi-point geometry represented by the input GeoJSON data. @en
label: GeoJSON to WKT multi-point @en

GeoJSON zu WKT Multi-Polygon
type: NamedIndividual
type: Function
comment: Benutzerdefinierte RML-Funktion die eine Liste von GeoJSON-String-Representationen von Polygonen entgegennimmt und eine WKT-String-Repräsentation eines Multipolygons der Eingabedaten zurückgibt
comment: Custom RML function that takes a list of string representations of GeoJSON polygons as input and returns a WKT string of the multi-polygon geometry represented by the input GeoJSON data @en
label: GeoJSON to WKT multi-polygon @en

GeoJSON zu WKT-Punkt
type: NamedIndividual
type: Function
comment: Benutzerdefinierte RML-Funktion, die eine Liste mit (normalerweise) einer String-Repräsentaion eines Punktes entgegennimmt und einen WKT-String für den Punkt zurückgibt.
comment: Custom RML function that takes a (singleton) list of point strings as input and returns a WKT string for the point geometry represented by the GeoJSON data @en
label: GeoJSON to WKT point @en

GeoJSON zu WKT-Polygon
type: NamedIndividual
type: Function
comment: Benutzerdefinierte RML-Funktion, die eine Liste mit einer GeoJSON-String-Repräsentationen von einem Polygonen entgegennimmt und eine WKT-String-Repräsentation des Polygons zurückgibt
comment: Custom RML function that takes a singleton list of string representations of GeoJSON polygons as input and returns a WKT string of the polygon geometry represented by the input GeoJSON data @en
label: GeoJSON to WKT polygon @en

GeoJSON zu WKT-String
type: NamedIndividual
type: Function
comment: Benutzerdefinierte RML-Funktion, die einen Geometrietyp und eine Liste mit GeoJSON-Geometrie-Strings entgegennimmt und einen WKT-String der Geometrien zurückgibt.
comment: Custom RML function that takes a geometry type and a list of string representations of GeoJSON geometries and returns a WKT string representation of the geometries @en
label: GeoJSON to WKT string @en

Geometriedaten
type: NamedIndividual
type: Parameter
comment: List of strings representing geometries @en
comment: Liste von Strings die Geometrien representieren
label: Geometry data @en

Geometrietyp
type: NamedIndividual
type: Parameter
comment: A string indicating the geometry type (point, multi-point, line string, multi-line string, polygon, multi-polygon) @en
comment: Ein String, der einen Geometrietyp bestimmt (Punkt, Multi-Punkt, Linienzug, Multi-Linienzug, Polygon, Multi-Polygon)
label: Geometry type @en

Deichverteidigungsgebiet von Gebietsname
type: NamedIndividual
type: Function
comment: Benutzerdefinierte RML-Funktion, die die IRI eines Deichverteidigungsgebiets zurückgibt
comment: Custom RML function that returns the proper IRI of a dike defense area referred to by name. @en
label: Get dike defense area @en

E-Mail-Adresse zu E-Mail-Adress-IRI
type: NamedIndividual
type: Function
comment: Benutzerdefinierte RML-Funktion, die für eine Eingabe-E-Mail-Adresse eine vollstandige IRI zurückgibt, sofern die E-Mail-Adresse nicht leer ist
comment: Custom RML function that returns a proper IRI for an input e-mail address string if it is not empty @en
label: Get e-mail address IRI @en

FMS-Code zu Fahrzeugstatus
type: NamedIndividual
type: Function
comment: Benutzerdefinierte RML-Funktion, die für ein Eingabe-Fahrzeugtyp und einen FMS-Code die IRI der Zusatndsklasse des Fahrzeugs zurückgibt
comment: Custom RML function that returns the state concept IRI given an FMS state code and a vehicle class @en
label: Get emergency vehicle status @en

Ereigniskategorie-Klasse von Ereigniskategoie-ID
type: NamedIndividual
type: Function
comment: Custom RML function that returns the class IRI for an event category referred to by an ID string given as input to the function @en
comment: Eine benutzerdefinierte RML-Funktion die die IRI für eine Eingabe-Ereigniskategorie-ID zurückgibt
label: Get event category class @en

Einrichtungstyp-IRIs für Einrichtungstypenliste
type: NamedIndividual
type: Function
comment: Benutzerdefinierte RML-Funktion, die für einen Eingabe-String mit komma-separierten Einrichtungstypen eine Liste von Einrichtungstyp-IRIs zurück gibt
comment: Custom RML function that returns class IRIs for a comma-separated values input string with facility type names @en
label: Get facility type IRIs @en

Bauwerkstyp-IRI von Bauwerkstyp
type: NamedIndividual
type: Function
comment: Funktion, die für einen Bauwerktypnamen eine Typ-IRI zurückgibt
comment: Given a type name as input this function returns the proper IRI of a fixed construction type @en
label: Get fixed construction type @en

Hash-URI für Eingabestring
type: NamedIndividual
type: Function
comment: Benutzerdefinierte RML-Funktion, die für einen beliebigen Eingabe-String einen URI im RESCUE-MATE-Ressource-Namensraum generiert, mit einem optionalen Präfix für den Local Part des URI
comment: Custom RML function that takes an arbitrary string and generates a URI in the RESCUE-MATE resource namespace with an optional prefix for the local part. @en
label: Get hash URI @en

IRI einer juristischen Person von Namen
type: NamedIndividual
type: Function
comment: Benutzerdefinierte RML-Funktion, die die IRI zu dem Namen oder Identifikator einer juristischen Person zurückgibt
comment: Custom RML function that returns the proper IRI of a juridical person referred to by name. @en
label: Get juridical person @en

Antriebsname zu Antriebsklassen-IRI
type: NamedIndividual
type: Function
comment: Benutzerdefinierte RML-Funktion, die für eine Antriebsart die korrekte Klassen-IRI zurückgibt
comment: Custom RML function that returns the IRI string of a propulsion type referred to by name @en
label: Get propulsion type @en

Social-Media-Dienst-IRI von Social-Media-Dienst-Name
type: NamedIndividual
type: Function
comment: Benutzerdefinierte RML-Funktion, die die IRI zu dem Namen oder Identifikator eines Social-Media-Dienstes zurückgibt
comment: Custom RML function that returns the proper IRI of a social media service referred to by name. @en
label: Get social media service @en

Social-Media-Nutzer:in-IRI von Social-Media-Nutzer:in-Name
type: NamedIndividual
type: Function
comment: Benutzerdefinierte RML-Funktion, die die IRI zu dem Namen oder Identifikator einer Social-Media-Nutzer:in zurückgibt
comment: Custom RML function that returns the proper IRI of a social media user referred to by name. @en
label: Get social media user @en

Gib die EIngabe zurück, sofern nicht null
type: NamedIndividual
type: Function
comment: Benutzerdefinierte RML-Funktion, die den Eingabewert zurückgibt, sofern er nicht irgendeine Art von NULL-Wert repräsentiert. Falls die Eingabe einen NULL-Wert repräsentiert, wird das Java-null-Objekt zurückgegeben.
comment: Custom RML function that returns the input value if it is not a null value. If the input string represents any kind of null value, the built-in Java null value is returned. @en
label: Get value if not null @en

Fahrzeugtyp-IRI von Typ
type: NamedIndividual
type: Function
comment: Benutzerdefinierte RML-Funktion die die IRI eines Fahrzeugtyps zu einer Typabkürzung oder -ID zurückgibt
comment: Custom RML function that returns the class IRI of a vehicle referred to by an ID or abbreviation @en
label: Get vehicle type IRI @en

Hamburg Port Authority (HPA)
type: NamedIndividual
type: Anstalt des öffentlichen Rechts

Harburg (Deichverteidigungsgebiet)
type: NamedIndividual
type: Deichverteidigungsgebiet
label: Harburg (dike defense area) @en

ID-String
type: NamedIndividual
type: Parameter
comment: String holding an ID or name @en
comment: String, der eine ID oder einen Name beinhaltet
label: ID string @en

Innenstadt (Deichverteidigungsgebiet)
type: NamedIndividual
type: Deichverteidigungsgebiet
label: Innenstadt (dike defense area) @en

Name einer juristischen Person
type: NamedIndividual
type: Parameter
comment: Name oder Identifikator einer juristischen Person
comment: The name or ID of a juridical person @en
label: Juridical person name @en

Breitengrad
type: NamedIndividual
type: Parameter
comment: A string containing the latitude information @en
comment: Ein String der Breitengrad-Informationen enthält
label: Latitude @en

Linienzüge-Liste
type: NamedIndividual
type: Parameter
comment: A list containing strings that represent line strings @en
comment: Eine Liste die Strings enthält, die Linienzüge repräsentieren.
label: Line strings list @en

Local-Part-Präfix
type: NamedIndividual
type: Parameter
comment: A prefix for the local part of a URI @en
comment: Präfix des Local Parts eines URI
label: Local part prefix @en

Längengrad
type: NamedIndividual
type: Parameter
comment: A string containing the longitude information @en
comment: Ein String der Längengrad-Informationen enthält
label: Longitude @en

Landesbetrieb Straßen, Brücken und Gewässer (LSBG) (Hamburg)
type: NamedIndividual
type: Landesbetrieb

Date-Time-Stamp zu Date-Time-Stamp mit Zeitzoneninformation
type: NamedIndividual
type: Function
comment: Benutzerdefinierte RML-Funktion, die für einen beliebigen Eingabe-Date-Time-Stamp-String einen Date-Time-Stamp-String mit vollständiger Zeitzoneninformation zurückgibt
comment: Custom RML function that returns a complete time stamp string, i.e., with time zone information, for an arbitrary input date-time stamp string @en
label: Make complete date-time stamp @en

Anzahl der Teilungen
type: NamedIndividual
type: Parameter
comment: An integer which refers to the number of times a string shall be split (from left to right) @en
comment: Eine natürliche Zahl, die angibt, die oft ein String an Leerzeichen aufgesplittet werden soll
label: Number of Splits @en

Punkt-Liste
type: NamedIndividual
type: Parameter
comment: A (singleton) list that contains strings representing points @en
comment: Eine Liste die normalerweise einen String enthält, der einen Punkt repräsentiert.
label: Point list @en

Punkte-Liste
type: NamedIndividual
type: Parameter
comment: A list containing strings that represent points @en
comment: Eine Liste von Strings, die Punkte repräsentieren.
label: Points list @en

Polygon-Liste
type: NamedIndividual
type: Parameter
comment: A singleton list containing a string that represents a polygon @en
comment: Eine Liste mit einer GeoJSON-String-Repräsentation eines Polygons
label: Polygon list @en

Polygonenliste
type: NamedIndividual
type: Parameter
comment: A list containing strings that represent polygons @en
comment: Eine Liste mit String-Repräsentaionen von Polygonen
label: Polygons list @en

Antriebsname
type: NamedIndividual
type: Parameter
comment: Der Antriebsname
comment: The propulsion type name @en
label: Propulsion type string @en

Gib Klassen-IRI zurück, falls Wahrheitswert wahr ist
type: NamedIndividual
type: Function
label: Return class IRI if true @en

Rückgabeindex
type: NamedIndividual
type: Parameter
comment: Für eine gegebene Liste addressiert dieser Parameter den n-ten Eintrag, beginnend bei 0
comment: Given an array of entries, this parameter addresses the n-th entry starting at 0 @en
label: Return index @en

Schulbehörde (Hamburg)
type: NamedIndividual
type: Landesbehörde (Deutschland)

Senatskanzlei (Hamburg)
type: NamedIndividual
type: Landesbehörde (Deutschland)

Social-Media-Service-Name
type: NamedIndividual
type: Parameter
comment: A string containing the name of a social media service @en
comment: Ein String, der den Namen eines Social-Media-Services enthält
label: Social media service name @en

Behörde für Arbeit, Gesundheit, Soziales, Familie und Integration (Sozialbehörde) (Hamburg)
type: NamedIndividual
type: Landesbehörde (Deutschland)

Speichere Datei und gebe RESCUE-MATE URL zurück
type: NamedIndividual
type: Function
comment: Benutzerdefinierte RML-Funktion, die base64-enkodierten Dateiinhalt, einen Dateinamen und Dateityp entgegennimmt, den Dateiinhalt in einer Datei in der RESCUE-MATE-Plattform speichert und einen URL zurückgibt, unter dem auf die Datei zugegriffen werden kann
comment: Custom RML function that gets base64-encoded file content, a file name, and a file type, stores the file in the RESCUE-MATE data platform, and returns the URL where to access it via the RESCUE-MATE data platform. @en
label: Store file and return RM URL @en

String zu Boolean
type: NamedIndividual
type: Function
comment: Benutzerdefinierte RML-Funktion, die versucht, beliebige String-Eingaben in ein Boolean umzuwandeln
comment: Custom RML function that tries to convert any string input to a boollean value. @en
label: To Boolean @en

Längen- und Breitengrad zu WKT-Punkt-Literal
type: NamedIndividual
type: Function
comment: Benutzerdefinierte RML-Funktion, die ein String-Paar mit Koordinaten entgegennimmt und einen WKT-String für den Punkt zurückgibt, der von den Eingabedaten repräsentiert wird
comment: Custom RML function that takes a pair of coordinate strings as input and returns a WKT string for the point geometry represented by the input data @en
label: Longitude and latitude to WKT point literal @en

URL
type: NamedIndividual
type: Parameter
comment: A uniform resource locator @en
comment: Ein Uniform Resource Locator (URL)

Nutzername
type: NamedIndividual
type: Parameter
comment: A string containing the name of a user @en
comment: Ein String, der den Namen einer Nutzer:in enthält
label: User name @en

Wert-String
type: NamedIndividual
type: Parameter
comment: Any string representing a (JSON) value @en
comment: Beliebiger String, der einen (JSON-)Wert enthält
label: Value string @en

Fahrzeugtyp
type: NamedIndividual
type: Parameter
comment: A vehicle type given by ID or abbreviation @en
comment: ID oder Abkürzung eines Fahrzeugtyps
label: Vehicle type @en

Fahrzeug-Typ-IRI
type: NamedIndividual
type: Parameter
comment: IRI des Fahrzeugtyps
comment: The IRI of the vehicle type @en
label: Vehicle type IRI @en

Wilhelmsburg (Deichverteidigungsgebiet)
type: NamedIndividual
type: Deichverteidigungsgebiet
label: Wilhelmsburg (dike defense area) @en